{"text_format":"1","workbook":"xlsx","n_sheets":61,"sheets":["39%","Pg Setup Copies","Needs Page Setup","Bob (later) 1","AutoSum","Totals","Show Arrange All Order","All Chars in font","Formatting Errors","Only Unique","For Later (Bob)","Filling Holes","Skip Blanks","Distribute","Files etc","Mirror","Enter Totals","Change Row Height","TextToColumns","Double-Space","History ","Another Bob","Misc1","Find Backwards","Merge","Where are Row#s","Match Wildcard","Cut Copy InsertPaste","Conditional Formatting","TEXT, REPT","Last String","Wait","Right Click FH","Space Operator","Picture","Advanced No Fmt, Prot Range","Sort Columns","Number Wednesdays","Pictograph","Mailing Labels 1","Mailing Labels 2","Mailing Labels 3","1st and 15th","Fill right, down","Inner Series","Random Sample","Auto Number Qs","Self-defining Range","Printing Remote Areas","Ctrl-6","Advanced Filter","Aligning Objects","Custom List","Whats This","Add Time","Dynamic Array","VBA","Amazing Formula","Supporting Data","Miscellaneous","Email"],"not_rendered":{"charts":3,"images":11,"macros":1,"external_links":0,"defined_names":43,"comments":1,"pivot_tables":0},"unopened":[],"bounds":{"document_bytes":16777216,"sheet_cells":100000,"rows_first":2000,"rows_last":500,"rows_between":2000,"halvings":0,"cell_chars":16384,"cell_head_chars":4096},"cells_cut":0,"cells_raw":0,"read":"whole","date_system":"1900"}

{"sheet":"39%","index":0,"n_rows":23,"n_cols":7,"rows_kept":23,"cut":false,"hidden":false,"merged":[[0,1,3,4],[22,1,22,6]]}
[null,"Hi! I'm Bob Umlas. Many of the tips from this session are from my book:",null,null,null,null,"You can find my other books"]
[null,null,null,null,null,null,"by typing UMLAS into Amazon.com"]
[]
[]
[]
[]
{"$rows_left_out":18}
{"sheet":"Pg Setup Copies","index":1,"n_rows":13,"n_cols":4,"rows_kept":13,"cut":false,"hidden":false,"merged":[]}
[null,null,null,"This contains page setup for"]
[null,null,null,"page setup demo"]
[null,"For quick formatting:"]
["Ctrl+shift+:",3,3]
[1,3,3]
[2,3,3]
{"$rows_left_out":8}
{"sheet":"Needs Page Setup","index":2,"n_rows":12,"n_cols":7,"rows_kept":12,"cut":false,"hidden":false,"merged":[]}
["Some Data","Some Data","Some Data","Some Data","Some Data","Some Data","Some Data"]
["Some Data","Some Data","Some Data","Some Data","Some Data","Some Data","Some Data"]
["Some Data","Some Data","Some Data","Some Data","Some Data","Some Data","Some Data"]
["Some Data","Some Data","Some Data","Some Data","Some Data","Some Data","Some Data"]
["Some Data","Some Data","Some Data","Some Data","Some Data","Some Data","Some Data"]
["Some Data","Some Data","Some Data","Some Data","Some Data","Some Data","Some Data"]
{"$rows_left_out":7}
{"sheet":"Bob (later) 1","index":3,"n_rows":2,"n_cols":2,"rows_kept":2,"cut":false,"hidden":false,"merged":[]}
[1,1]
[1,1]

{"sheet":"AutoSum","index":4,"n_rows":34,"n_cols":4,"rows_kept":34,"cut":false,"hidden":false,"merged":[]}
[65,54,30,46]
[84,85,87,74]
[14,69,78,97]
[88,42,71,6]
[5,32,71,62]
[57,47,65,2]
{"$rows_left_out":29}
{"sheet":"Totals","index":5,"n_rows":138,"n_cols":2,"rows_kept":138,"cut":false,"hidden":false,"merged":[]}
[null,22]
[null,20]
[null,15]
[null,6]
[null,98]
[null,94]
{"$rows_left_out":133}
{"sheet":"Show Arrange All Order","index":6,"n_rows":1,"n_cols":1,"rows_kept":1,"cut":false,"hidden":false,"merged":[]}
["Live demo"]

{"sheet":"All Chars in font","index":7,"n_rows":255,"n_cols":10,"rows_kept":255,"cut":false,"hidden":false,"merged":[]}
["ARIAL","CENTURY","Tahoma","WINGDINGS","Webdings"]
[{"$f":"CHAR(ROW())","v":"\u0002"},"\u0002","\u0002","\u0002","\u0002",null,"Alt/7 (NK)","•",null,"o"]
["\u0003","\u0003","\u0003","\u0003","\u0003",null,"Alt/3-4-5-6","♥♦♣♠",null,"þ"]
["\u0004","\u0004","\u0004","\u0004","\u0004"]
["\u0005","\u0005","\u0005","\u0005","\u0005"]
["\u0006","\u0006","\u0006","\u0006","\u0006"]
{"$rows_left_out":250}
{"sheet":"Formatting Errors","index":8,"n_rows":5,"n_cols":5,"rows_kept":5,"cut":false,"hidden":false,"merged":[]}
[null,"By Number Formatting","By Conditional Formatting","Usual","By Formula"]
["Numerator",{"$f":"A3/A5","v":10},{"$f":"A3/A5","v":10},{"$f":"A3/A5","v":10},{"$f":"IF(A5=0,\"\",A3/A5)","v":10}]
[15000]
["Denominator"]
[1500]

{"sheet":"Only Unique","index":9,"n_rows":11,"n_cols":4,"rows_kept":11,"cut":false,"hidden":false,"merged":[]}
[1,null,null,"Can contain only unique values"]
[2,null,null,1]
[3,null,null,2]
[4,null,null,3]
[4,null,null,4]
[1,null,null,5]
{"$rows_left_out":6}
{"sheet":"For Later (Bob)","index":10,"n_rows":2,"n_cols":2,"rows_kept":2,"cut":false,"hidden":false,"merged":[]}
[2,2]
[2,2]

{"sheet":"Filling Holes","index":11,"n_rows":99,"n_cols":3,"rows_kept":99,"cut":false,"hidden":false,"merged":[]}
["State","Region","Amount"]
["PA","North",300]
[null,null,104]
[null,null,159]
[null,null,749]
[null,"South",700]
{"$rows_left_out":94}
{"sheet":"Skip Blanks","index":12,"n_rows":25,"n_cols":2,"rows_kept":25,"cut":false,"hidden":false,"merged":[]}
["a","b"]
[]
["c","d"]
[]
["e","f"]
[]
{"$rows_left_out":20}
{"sheet":"Distribute","index":13,"n_rows":15,"n_cols":5,"rows_kept":15,"cut":false,"hidden":false,"merged":[]}
[null,null,123]
[null,null,null,null,{"$f":"(C15-C1)/(ROW(C15)-ROW(C1))","v":30.785714285714285}]
[]
[]
[]
[]
{"$rows_left_out":10}
{"sheet":"Files etc","index":14,"n_rows":3,"n_cols":5,"rows_kept":3,"cut":false,"hidden":false,"merged":[]}
["Files","Excel Files","Tab Names","Fl","=TRANSPOSE(FILES())"]
["=Fl","=FLx","=TabNames","Flx","=TRANSPOSE(FILES(\"*.xl*\"))"]
[null,null,null,"TabNames","=SORT(TRANSPOSE(MID(GET.WORKBOOK(1),FIND(\"]\",GET.WORKBOOK(1))+1,255)))"]

{"sheet":"Mirror","index":15,"n_rows":1,"n_cols":1,"rows_kept":1,"cut":false,"hidden":false,"merged":[]}
[4]

{"sheet":"Enter Totals","index":16,"n_rows":13,"n_cols":29,"rows_kept":13,"cut":false,"hidden":false,"merged":[]}
[null,"Jan","% of Q Total","Feb","% of Q Total","Mar","% of Q Total","Q1","Apr","% of Q Total","May","% of Q Total","Jun","% of Q Total","Q2","Jul","% of Q Total","Aug","% of Q Total","Sep","% of Q Total","Q3","Oct","% of Q Total","Nov","% of Q Total","Dec","% of Q Total","Q4"]
[null,285,{"$f":"B2/H2","v":0.1744186046511628},857,{"$f":"D2/H2","v":0.5244798041615667},492,{"$f":"F2/H2","v":0.30110159118727048},{"$f":"B2+D2+F2","v":1634},582,{"$f":"I2/O2","v":0.35815384615384616},272,{"$f":"K2/O2","v":0.16738461538461538},771,{"$f":"M2/O2","v":0.47446153846153843},{"$f":"I2+K2+M2","v":1625},633,{"$f":"P2/V2","v":0.53104026845637586},511,{"$f":"R2/V2","v":0.42869127516778521},48,{"$f":"T2/V2","v":4.0268456375838924E-2},{"$f":"P2+R2+T2","v":1192},616,{"$f":"W2/AC2","v":0.28400184416781926},921,{"$f":"Y2/AC2","v":0.42461964038727523},632,{"$f":"AA2/AC2","v":0.29137851544490551},{"$f":"W2+Y2+AA2","v":2169}]
[null,353,{"$f":"B3/H3","v":0.65491651205936918},49,{"$f":"D3/H3","v":9.0909090909090912E-2},137,{"$f":"F3/H3","v":0.25417439703153988},539,704,{"$f":"I3/O3","v":0.33020637898686678},912,{"$f":"K3/O3","v":0.42776735459662291},516,{"$f":"M3/O3","v":0.24202626641651032},2132,171,{"$f":"P3/V3","v":0.16442307692307692},431,{"$f":"R3/V3","v":0.41442307692307695},438,{"$f":"T3/V3","v":0.42115384615384616},1040,251,{"$f":"W3/AC3","v":0.26532769556025371},310,{"$f":"Y3/AC3","v":0.32769556025369978},385,{"$f":"AA3/AC3","v":0.40697674418604651},{"$f":"W3+Y3+AA3","v":946}]
[null,339,0.35423197492163011,525,0.54858934169278994,93,9.7178683385579931E-2,957,28,0.12556053811659193,73,0.3273542600896861,122,0.547085201793722,223,228,0.17104276069017255,724,0.54313578394598649,381,0.28582145536384096,1333,531,0.41745283018867924,710,0.55817610062893086,31,2.4371069182389939E-2,1272]
[null,664,0.33877551020408164,564,0.28775510204081634,732,0.37346938775510202,1960,719,0.50598170302603795,623,0.43842364532019706,79,5.5594651653764954E-2,1421,911,0.3881550916063059,742,0.31614827439284193,694,0.29569663400085217,2347,389,0.3034321372854914,371,0.28939157566302653,522,0.40717628705148207,1282]
[null,584,0.33601841196777904,650,0.37399309551208287,504,0.28998849252013809,1738,702,0.29458665547629037,813,0.34116659672681493,868,0.36424674779689464,2383,599,0.38997395833333331,547,0.35611979166666669,390,0.25390625,1536,986,0.36077570435418954,756,0.27661909989023054,991,0.36260519575557992,2733]
{"$rows_left_out":8}
{"sheet":"Change Row Height","index":17,"n_rows":52,"n_cols":1,"rows_kept":52,"cut":false,"hidden":false,"merged":[]}
["Department"]
["Accounting"]
["Accounting"]
["Accounting"]
["Accounting"]
["Accounting"]
{"$rows_left_out":47}
{"sheet":"TextToColumns","index":18,"n_rows":14,"n_cols":1,"rows_kept":14,"cut":false,"hidden":false,"merged":[]}
[20101026]
[20100405]
[20080110]
[20080904]
[20090108]
[]
{"$rows_left_out":9}
{"sheet":"Double-Space","index":19,"n_rows":850,"n_cols":4,"rows_kept":850,"cut":false,"hidden":false,"merged":[]}
["lots of stuff 1","lots of stuff 1","lots of stuff 1","lots of stuff 1"]
["lots of stuff 2","lots of stuff 2","lots of stuff 2","lots of stuff 2"]
["lots of stuff 3","lots of stuff 3","lots of stuff 3","lots of stuff 3"]
["lots of stuff 4","lots of stuff 4","lots of stuff 4","lots of stuff 4"]
["lots of stuff 5","lots of stuff 5","lots of stuff 5","lots of stuff 5"]
["lots of stuff 6","lots of stuff 6","lots of stuff 6","lots of stuff 6"]
{"$rows_left_out":845}
{"sheet":"History ","index":20,"n_rows":1,"n_cols":5,"rows_kept":1,"cut":false,"hidden":false,"merged":[]}
["Rename to History",null,null,null,"You can go to RxCx in the Name box"]

{"sheet":"Another Bob","index":21,"n_rows":2,"n_cols":2,"rows_kept":2,"cut":false,"hidden":false,"merged":[]}
[3,3]
[3,3]

{"sheet":"Misc1","index":22,"n_rows":45,"n_cols":27,"rows_kept":45,"cut":false,"hidden":false,"merged":[]}
["Type 1e6 or 1e9 instead of 1000000 or 1000000000",null,null,null,null,null,null,null,"=sum('*Bob*'!a1:B2)"]
[null,null,null,null,null,null,10000000]
[null,null,null,null,null,null,null,null,"Shift/fill handle drag up to delete"]
["Format painter to turn this arrow",null,null,null,"into this arrow",null,null,null,"go to z"]
[]
[null,null,null,null,null,null,null,null,"Ctrl/period"]
{"$rows_left_out":40}
{"sheet":"Find Backwards","index":23,"n_rows":1503,"n_cols":1,"rows_kept":1503,"cut":false,"hidden":false,"merged":[]}
["Department"]
["Acctg"]
["Acctg"]
["Acctg"]
["Acctg"]
["Acctg"]
{"$rows_left_out":1498}
{"sheet":"Merge","index":24,"n_rows":1,"n_cols":7,"rows_kept":1,"cut":false,"hidden":false,"merged":[[5,0,5,4],[0,0,0,4],[1,0,1,4],[2,0,2,4],[3,0,3,4],[4,0,4,4],[17,0,17,4],[6,0,6,4],[7,0,7,4],[8,0,8,4],[9,0,9,4],[10,0,10,4],[11,0,11,4],[12,0,12,4],[13,0,13,4],[14,0,14,4],[15,0,15,4],[16,0,16,4],[29,0,29,4],[18,0,18,4],[19,0,19,4],[20,0,20,4],[21,0,21,4],[22,0,22,4],[23,0,23,4],[24,0,24,4],[25,0,25,4],[26,0,26,4],[27,0,27,4],[28,0,28,4],[41,0,41,4],[30,0,30,4],[31,0,31,4],[32,0,32,4],[33,0,33,4],[34,0,34,4],[35,0,35,4],[36,0,36,4],[37,0,37,4],[38,0,38,4],[39,0,39,4],[40,0,40,4],[53,0,53,4],[42,0,42,4],[43,0,43,4],[44,0,44,4],[45,0,45,4],[46,0,46,4],[47,0,47,4],[48,0,48,4],[49,0,49,4],[50,0,50,4],[51,0,51,4],[52,0,52,4],[65,0,65,4],[54,0,54,4],[55,0,55,4],[56,0,56,4],[57,0,57,4],[58,0,58,4],[59,0,59,4],[60,0,60,4],[61,0,61,4],[62,0,62,4],[63,0,63,4],[64,0,64,4],[77,0,77,4],[66,0,66,4],[67,0,67,4],[68,0,68,4],[69,0,69,4],[70,0,70,4],[71,0,71,4],[72,0,72,4],[73,0,73,4],[74,0,74,4],[75,0,75,4],[76,0,76,4],[89,0,89,4],[78,0,78,4],[79,0,79,4],[80,0,80,4],[81,0,81,4],[82,0,82,4],[83,0,83,4],[84,0,84,4],[85,0,85,4],[86,0,86,4],[87,0,87,4],[88,0,88,4],[96,0,96,4],[97,0,97,4],[98,0,98,4],[99,0,99,4],[90,0,90,4],[91,0,91,4],[92,0,92,4],[93,0,93,4],[94,0,94,4],[95,0,95,4]]}
[null,null,null,null,null,null,"How did I merge each row A:E?"]

{"sheet":"Where are Row#s","index":25,"n_rows":0,"n_cols":0,"rows_kept":0,"cut":false,"hidden":false,"merged":[]}

{"sheet":"Match Wildcard","index":26,"n_rows":88,"n_cols":5,"rows_kept":88,"cut":false,"hidden":false,"merged":[]}
["Dept","Amt","% of Total"]
["Dept1",872,{"$f":"B2/INDEX(B:B,MATCH(\"*Total\",OFFSET(A2,0,0,1000,1),0)+ROW()-1)","v":9.0597402597402593E-2},null,{"$f":"B2/INDEX(B:B,MATCH(\"*Total\",OFFSET(A2,0,0,1000,1),0)+ROW()-1)","v":9.0597402597402593E-2}]
["Dept1",252,2.6181818181818181E-2,null,{"$f":"B3/INDEX(B:B,MATCH(\"*Total\",OFFSET(A3,0,0,1000,1),0)+ROW()-1)","v":2.6181818181818181E-2}]
["Dept1",304,3.1584415584415583E-2,null,{"$f":"B4/INDEX(B:B,MATCH(\"*Total\",OFFSET(A4,0,0,1000,1),0)+ROW()-1)","v":3.1584415584415583E-2}]
["Dept1",900,9.350649350649351E-2,null,{"$f":"B5/INDEX(B:B,MATCH(\"*Total\",OFFSET(A5,0,0,1000,1),0)+ROW()-1)","v":9.350649350649351E-2}]
["Dept1",444,4.6129870129870132E-2,null,{"$f":"B6/INDEX(B:B,MATCH(\"*Total\",OFFSET(A6,0,0,1000,1),0)+ROW()-1)","v":4.6129870129870132E-2}]
{"$rows_left_out":83}
{"sheet":"Cut Copy InsertPaste","index":27,"n_rows":15,"n_cols":6,"rows_kept":15,"cut":false,"hidden":false,"merged":[]}
[]
[]
[]
[null,1,45,"2020-01-01",63,72]
[null,2,50,"2020-02-01",70,80]
[null,3,55,"2020-03-01",77,88]
{"$rows_left_out":10}
{"sheet":"Conditional Formatting","index":28,"n_rows":0,"n_cols":0,"rows_kept":0,"cut":false,"hidden":false,"merged":[]}

{"sheet":"TEXT, REPT","index":29,"n_rows":14,"n_cols":4,"rows_kept":14,"cut":false,"hidden":false,"merged":[]}
[]
[]
[null,null,null,{"$f":"TEXT(TODAY(),\"dddd, m/d/yyyy\")","v":"Tuesday, 6/23/2020"}]
[null,null,null,{"$f":"TODAY()","v":"2020-06-23"}]
[]
[]
{"$rows_left_out":9}
{"sheet":"Last String","index":30,"n_rows":9,"n_cols":3,"rows_kept":9,"cut":false,"hidden":false,"merged":[]}
[]
[]
[]
["Start",null,"C:\\MSOFFICE\\EXCEL\\LIBRARY\\MSQUERY\\MyFile.xlsx"]
["Finish",null,{"$f":"MID(C4,SEARCH(CHAR(222),SUBSTITUTE(C4,\"\\\",CHAR(222),LEN(C4)-LEN(SUBSTITUTE(C4,\"\\\",\"\"))))+1,255)","v":"MyFile.xlsx"}]
["Steps",null,{"$f":"LEN(C4)-LEN(SUBSTITUTE(C4,\"\\\",\"\"))","v":5}]
{"$rows_left_out":4}
{"sheet":"Wait","index":31,"n_rows":0,"n_cols":0,"rows_kept":0,"cut":false,"hidden":false,"merged":[]}

{"sheet":"Right Click FH","index":32,"n_rows":1,"n_cols":2,"rows_kept":1,"cut":false,"hidden":false,"merged":[]}
["2006-03-27",25]

{"sheet":"Space Operator","index":33,"n_rows":9,"n_cols":5,"rows_kept":9,"cut":false,"hidden":false,"merged":[]}
[null,"North","West","South","East"]
["Things",{"$f":"INT(RAND()*100)","v":47},79,67,98]
["Gizmos",38,31,96,40]
["Objects",65,50,34,45]
[]
[]
{"$rows_left_out":4}
{"sheet":"Picture","index":34,"n_rows":8,"n_cols":1,"rows_kept":8,"cut":false,"hidden":false,"merged":[]}
["dog"]
[]
[]
[]
[]
["dog"]
{"$rows_left_out":3}
{"sheet":"Advanced No Fmt, Prot Range","index":35,"n_rows":25,"n_cols":11,"rows_kept":25,"cut":false,"hidden":false,"merged":[]}
[20,20,{"$f":"A1","v":20}]
[40,40,40]
[60,60,60]
[80,80,80]
[100,100,100]
[120,120,120]
{"$rows_left_out":20}
{"sheet":"Sort Columns","index":36,"n_rows":21,"n_cols":8,"rows_kept":21,"cut":false,"hidden":false,"merged":[]}
["Address","Name","State","City","Zip",null,"Want Name, Address, City, State, Zip"]
["123 Main","Name1","FL","Orlando",12345]
["124 Main","Name2","NY","Albany",12346]
["125 Main","Name3","WA","Redmond",12347]
["126 Main","Name4","TX","Houston",12348]
["127 Main","Name5","CA","Orlando",12349]
{"$rows_left_out":16}
{"sheet":"Number Wednesdays","index":37,"n_rows":3,"n_cols":1,"rows_kept":3,"cut":false,"hidden":false,"merged":[]}
["2016-10-01"]
[{"$f":"TODAY()","v":"2020-06-23"}]
[{"$f":"SUM(N(WEEKDAY(ROW(INDIRECT(A1&\":\"&A2)))=4))","v":194}]

{"sheet":"Pictograph","index":38,"n_rows":3,"n_cols":1,"rows_kept":3,"cut":false,"hidden":false,"merged":[]}
[1]
[2]
[3]

{"sheet":"Mailing Labels 1","index":39,"n_rows":18,"n_cols":1,"rows_kept":18,"cut":false,"hidden":false,"merged":[]}
["Jones, John"]
["JJAddress"]
["JJCity, State, Zip"]
[]
["Adams, Jane"]
["JAAddress"]
{"$rows_left_out":13}
{"sheet":"Mailing Labels 2","index":40,"n_rows":30,"n_cols":3,"rows_kept":30,"cut":false,"hidden":false,"merged":[]}
["Name1","Addr1","City, State Zip1"]
["Name2","Addr2","City, State Zip2"]
["Name3","Addr3","City, State Zip3"]
["Name4","Addr4","City, State Zip4"]
["Name5","Addr5","City, State Zip5"]
["Name6","Addr6","City, State Zip6"]
{"$rows_left_out":25}
{"sheet":"Mailing Labels 3","index":41,"n_rows":159,"n_cols":8,"rows_kept":159,"cut":false,"hidden":false,"merged":[]}
["Name1",null,{"$f":"A1","v":"Name1"},{"$f":"A2","v":"address1"},{"$f":"A3","v":"City, State Zip1"},null,"Using Sequence==>","=INDEX(A:A,SEQUENCE(160/4,4))"]
["address1",null,{"$f":"A5","v":"Craig"},{"$f":"A6","v":"address2"},{"$f":"A7","v":"City, State Zip2"}]
["City, State Zip1"]
[]
["Craig"]
["address2"]
{"$rows_left_out":154}
{"sheet":"1st and 15th","index":42,"n_rows":3,"n_cols":5,"rows_kept":3,"cut":false,"hidden":false,"merged":[]}
["2010-01-01",null,null,null,"2010-01-01"]
[null,"Create months, ",null,null,"2010-01-15"]
["2010-02-01","insert cell above+14"]

{"sheet":"Fill right, down","index":43,"n_rows":8,"n_cols":10,"rows_kept":8,"cut":false,"hidden":false,"merged":[]}
["Here's",null,"Here's","the","information","to","see","top","to","bottom"]
["the"]
["information"]
["to "]
["see",null,null,{"$f":"A1","v":"Here's"}]
["left"]
{"$rows_left_out":3}
{"sheet":"Inner Series","index":44,"n_rows":21,"n_cols":4,"rows_kept":21,"cut":false,"hidden":false,"merged":[]}
["Rate",3.2500000000000001E-2]
["Nper",30]
["PV",400000]
[]
[null,"<office 365",null,"office 365"]
[null,{"$f":"IPMT($B$1/12,ROW(A1),$B$2*12,-$B$3)","v":1083.3333333333333},null,{"$f":"IPMT($B$1/12,_xlfn.SEQUENCE(16),$B$2*12,-$B$3)","v":1083.3333333333333}]
{"$rows_left_out":16}
{"sheet":"Random Sample","index":45,"n_rows":101,"n_cols":3,"rows_kept":101,"cut":false,"hidden":false,"merged":[]}
["Database of 100 items"]
["Item1",null,{"$f":"RAND()<0.25","v":true}]
["Item2"]
["Item3"]
["Item4"]
["Item5"]
{"$rows_left_out":96}
{"sheet":"Auto Number Qs","index":46,"n_rows":30,"n_cols":2,"rows_kept":30,"cut":false,"hidden":false,"merged":[]}
["Question#","Question"]
[{"$f":"MAX(A$1:A1)+1","v":1},"Blah blah blah blah blah blah blah blah blah blah"]
[null,"Blah blah blah blah blah blah blah blah blah blah"]
[null,"Blah blah blah blah blah blah blah blah blah blah"]
[null,"Blah blah blah blah blah blah blah blah blah blah"]
[]
{"$rows_left_out":25}
{"sheet":"Self-defining Range","index":47,"n_rows":15,"n_cols":5,"rows_kept":15,"cut":false,"hidden":false,"merged":[]}
["Jan","Feb","Mar","Apr","May"]
[963,30,830,67,395]
[791,942,877,536,286]
[932,23,931,102,249]
[976,248,190,228,503]
[375,463,350,324,48]
{"$rows_left_out":10}
{"sheet":"Printing Remote Areas","index":48,"n_rows":24,"n_cols":25,"rows_kept":24,"cut":false,"hidden":false,"merged":[]}
["Area1","Area1","Area1","Area1","Area1"]
["Area1","Area1","Area1","Area1","Area1"]
["Area1","Area1","Area1","Area1","Area1"]
["Area1","Area1","Area1","Area1","Area1",null,null,null,null,null,null,null,null,null,null,null,null,null,null,null,null,null,"Area3","Area3","Area3"]
["Area1","Area1","Area1","Area1","Area1",null,null,null,null,null,null,null,null,null,null,null,null,null,null,null,null,null,"Area3","Area3","Area3"]
["Area1","Area1","Area1","Area1","Area1",null,null,null,null,null,null,null,null,null,null,null,null,null,null,null,null,null,"Area3","Area3","Area3"]
{"$rows_left_out":19}
{"sheet":"Ctrl-6","index":49,"n_rows":13,"n_cols":6,"rows_kept":13,"cut":false,"hidden":false,"merged":[]}
[]
[]
[]
[]
[]
[]
{"$rows_left_out":8}
{"sheet":"Advanced Filter","index":50,"n_rows":1,"n_cols":3,"rows_kept":1,"cut":false,"hidden":false,"merged":[]}
[null,null,"Use AnotherRg as name, filter to A1, choose Unique"]

{"sheet":"Aligning Objects","index":51,"n_rows":8,"n_cols":7,"rows_kept":8,"cut":false,"hidden":false,"merged":[]}
[]
[]
[]
[]
[]
["Align"]
{"$rows_left_out":3}
{"sheet":"Custom List","index":52,"n_rows":26,"n_cols":2,"rows_kept":26,"cut":false,"hidden":false,"merged":[]}
[{"$f":"CHAR(_xlfn.SEQUENCE(26,1,65))","v":"A"},{"$f":"CHAR(_xlfn.SEQUENCE(26,1,97))","v":"a"}]
["B","b"]
["C","c"]
["D","d"]
["E","e"]
["F","f"]
{"$rows_left_out":21}
{"sheet":"Whats This","index":53,"n_rows":2,"n_cols":475,"rows_kept":2,"cut":false,"hidden":false,"merged":[]}
[]
[null,null,null,null,null,null,null,null,null,null,null,null,null,null,null,null,null,null,null,null,null,null,null,null,null,null,null,null,null,null,null,null,null,null,null,null,null,null,null,null,null,null,null,null,null,null,null,null,null,null,null,null,null,null,null,null,null,null,null,null,null,null,null,null,null,null,null,null,null,null,null,null,null,null,null,null,null,null,null,null,null,null,null,null,null,null,null,null,null,null,null,null,null,null,null,null,null,null,null,null,null,null,null,null,null,null,null,null,null,null,null,null,null,null,null,null,null,null,null,null,null,null,null,null,null,null,null,null,null,null,null,null,null,null,null,null,null,null,null,null,null,null,null,null,null,null,null,null,null,null,null,null,null,null,null,null,null,null,null,null,null,null,null,null,null,null,null,null,null,null,null,null,null,null,null,null,null,null,null,null,null,null,null,null,null,null,null,null,null,null,null,null,null,null,null,null,null,null,null,null,null,null,null,null,null,null,null,null,null,null,null,null,null,null,null,null,null,null,null,null,null,null,null,null,null,null,null,null,null,null,null,null,null,null,null,null,null,null,null,null,null,null,null,null,null,null,null,null,null,null,null,null,null,null,null,null,null,null,null,null,null,null,null,null,null,null,null,null,null,null,null,null,null,null,null,null,null,null,null,null,null,null,null,null,null,null,null,null,null,null,null,null,null,null,null,null,null,null,null,null,null,null,null,null,null,null,null,null,null,null,null,null,null,null,null,null,null,null,null,null,null,null,null,null,null,null,null,null,null,null,null,null,null,null,null,null,null,null,null,null,null,null,null,null,null,null,null,null,null,null,null,null,null,null,null,null,null,null,null,null,null,null,null,null,null,null,null,null,null,null,null,null,null,null,null,null,null,null,null,null,null,null,null,null,null,null,null,null,null,null,null,null,null,null,null,null,null,null,null,null,null,null,null,null,null,null,null,null,null,null,null,null,null,null,null,null,null,null,null,null,null,null,null,null,null,null,null,null,null,null,null,null,null,null,null,null,null,null,null,null,null,null,null,null,null,null,null,null,null,null,null,null,null,null,null,null,null,null,null,null,null,null,null,null,null,null,null,null,null,null,null,null,null,null,"What sea creature is this?"]

{"sheet":"Add Time","index":54,"n_rows":6,"n_cols":3,"rows_kept":6,"cut":false,"hidden":false,"merged":[]}
[null,"03:15:00"]
[null,"04:15:00"]
[null,"05:15:00"]
[null,"06:15:00"]
[null,"07:15:00"]
["Total Time",{"$f":"SUM(B1:B5)","v":1.09375},{"$f":"SUM(B1:B5)","v":1.09375}]
{"$rows_left_out":1}
{"sheet":"Dynamic Array","index":55,"n_rows":9,"n_cols":9,"rows_kept":9,"cut":false,"hidden":false,"merged":[]}
[{"$f":"INDEX(_xlfn.SORTBY(_xlfn.SEQUENCE(9),_xlfn.RANDARRAY(9)),_xlfn.SEQUENCE(3,3))","v":9},6,5,null,null,{"$f":"_xlfn.SEQUENCE(9)","v":1},{"$f":"_xlfn.RANDARRAY(9)","v":0.10717946792360733}]
[7,3,4,null,null,2,0.46767961860585161,null,"Want 3x3 grid of non-repeating integers 1-9"]
[8,2,1,null,null,3,1.4230158641254986E-2]
[null,null,null,null,null,4,0.36860740646844703]
[null,null,null,null,null,5,0.50361146958288905]
[null,null,null,null,null,6,0.32430440549026662]
{"$rows_left_out":4}
{"sheet":"VBA","index":56,"n_rows":3,"n_cols":1,"rows_kept":3,"cut":false,"hidden":false,"merged":[]}
["Locals window is read/write"]
[1]
["You can bookmark the Immediate Window"]

{"sheet":"Amazing Formula","index":57,"n_rows":11,"n_cols":9,"rows_kept":11,"cut":false,"hidden":false,"merged":[]}
["Subtotal 109:",{"$f":"SUBTOTAL(109,'Supporting Data'!C:C)","v":592763},null,null,null,null,null,null,{"$f":"_xlfn.FORMULATEXT(B1)","v":"=SUBTOTAL(109,'Supporting Data'!C:C)"}]
[null,{"$f":"SUMPRODUCT(SUBTOTAL(109,'Supporting Data'!C2:C123),N('Supporting Data'!$A$2:$A$123=A5))","v":{"$error":"#VALUE!"}},null,null,null,null,null,null,{"$f":"_xlfn.FORMULATEXT(B2)","v":"=SUMPRODUCT(SUBTOTAL(109,'Supporting Data'!C2:C123),N('Supporting Data'!$A$2:$A$123=A5))"}]
[]
["Service","Total",null,"Alternate"]
["ES",{"$f":"SUMPRODUCT(SUBTOTAL(109,OFFSET('Supporting Data'!$C$1,_xlfn.SEQUENCE(122),0)),N('Supporting Data'!$A$2:$A$123=A5))","v":131174},null,{"$f":"SUMIF('Supporting Data'!$A$2:$A$123,A5,'Supporting Data'!$G$2:$G$123)","v":131174}]
["BU",{"$f":"SUMPRODUCT(SUBTOTAL(109,OFFSET('Supporting Data'!$C$1,_xlfn.SEQUENCE(122),0)),N('Supporting Data'!$A$2:$A$123=A6))","v":96757},null,{"$f":"SUMIF('Supporting Data'!$A$2:$A$123,A6,'Supporting Data'!$G$2:$G$123)","v":96757}]
{"$rows_left_out":6}
{"sheet":"Supporting Data","index":58,"n_rows":123,"n_cols":10,"rows_kept":123,"cut":false,"hidden":false,"merged":[]}
["Service","City","Amount","Date",null,null,null,null,null,{"$f":"G3","v":2475}]
["JKP","New York",3112,"2017-02-08T15:14:34.545",null,null,{"$f":"SUBTOTAL(109,C2)","v":3112}]
["ES","New York",2475,"2017-10-19T09:10:36.422",null,null,{"$f":"SUBTOTAL(109,C3)","v":2475}]
["AW","Miami",2018,"2017-05-08T19:42:18.601",null,null,2018]
["AW","Atlanta",9893,"2017-06-18T15:24:07.956",null,null,9893]
["BU","Amsterdam",328,"2017-01-05T04:22:57.065",null,null,328]
{"$rows_left_out":118}
{"sheet":"Miscellaneous","index":59,"n_rows":48,"n_cols":1,"rows_kept":48,"cut":false,"hidden":false,"merged":[]}
["Shift/fill handle to insert/delete"]
["right-click border drag & drop"]
["Right-click drag fillhandle options"]
["Clear print area by selecting all cells & setting print area"]
["Ctrl/shift 1-2-3-4-5-6 for formatting"]
["ctrl/quote to copy VALUE of above cell"]
{"$rows_left_out":43}
{"sheet":"Email","index":60,"n_rows":9,"n_cols":7,"rows_kept":9,"cut":false,"hidden":false,"merged":[]}
[]
[]
[]
[null,null,null,null,null,"I can be reached at:"]
[null,null,null,null,null,"BobUmlas@Hotmail.com"]
[]
{"$rows_left_out":3}