{"text_format":"1","workbook":"xlsx","n_sheets":2,"sheets":["Data","Cup Draw"],"not_rendered":{"charts":0,"images":0,"macros":1,"external_links":0,"defined_names":0,"comments":0,"pivot_tables":0},"unopened":[],"bounds":{"document_bytes":16777216,"sheet_cells":100000,"rows_first":2000,"rows_last":500,"rows_between":2000,"halvings":0,"cell_chars":16384,"cell_head_chars":4096},"cells_cut":0,"cells_raw":0,"read":"whole","date_system":"1900"}

{"sheet":"Data","index":0,"n_rows":81,"n_cols":27,"rows_kept":81,"cut":false,"hidden":true,"merged":[]}
["Draw Number",null,null,"Random","Rank","1st Round","Random","Rank","2nd Round","Random","Rank","3rd Round","Random","Rank","4th Round","Random","Rank","5th Round","Random","Rank","Quarter finals","Random","Rank","Semi Finals","Random","Rank","Final"]
[1,null,null,{"$f":"RAND()","v":0.62086649910969094},{"$f":"RANK(D2,$D$2:$D$81)+COUNTIF(E$1:E1,E1)-1","v":30},"Brighton",{"$f":"RAND()","v":0.20498179542561568},{"$f":"RANK(G2,$G$2:$G$41)+COUNTIF(H$1:H1,H1)-1","v":34},{"$f":"IF('Cup Draw'!B2=\"\",\"\",IF('Cup Draw'!B2>'Cup Draw'!D2,'Cup Draw'!A2,IF('Cup Draw'!B2<'Cup Draw'!D2,'Cup Draw'!E2)))","v":""},{"$f":"RAND()","v":0.22800441092515866},{"$f":"RANK(J2,$J$2:$J$65)+COUNTIF(K$1:K1,K1)-1","v":52},{"$f":"IF('Cup Draw'!H2=\"\",\"\",IF('Cup Draw'!H2>'Cup Draw'!J2,'Cup Draw'!G2,IF('Cup Draw'!H2<'Cup Draw'!J2,'Cup Draw'!K2)))","v":""},{"$f":"RAND()","v":0.88464565744109713},{"$f":"RANK(M2,$M$2:$M$33)+COUNTIF(N$1:N1,N1)-1","v":3},{"$f":"IF('Cup Draw'!N2=\"\",\"\",IF('Cup Draw'!N2>'Cup Draw'!P2,'Cup Draw'!M2,IF('Cup Draw'!N2<'Cup Draw'!P2,'Cup Draw'!Q2)))","v":""},{"$f":"RAND()","v":0.20080750289646021},{"$f":"RANK(P2,$P$2:$P$17)+COUNTIF(Q$1:Q1,Q1)-1","v":13},{"$f":"IF('Cup Draw'!T2=\"\",\"\",IF('Cup Draw'!T2>'Cup Draw'!V2,'Cup Draw'!S2,IF('Cup Draw'!T2<'Cup Draw'!V2,'Cup Draw'!W2)))","v":""},{"$f":"RAND()","v":5.4021929370655197E-2},{"$f":"RANK(S2,$S$2:$S$9)+COUNTIF(T$1:T1,T1)-1","v":7},{"$f":"IF('Cup Draw'!Z2=\"\",\"\",IF('Cup Draw'!Z2>'Cup Draw'!AB2,'Cup Draw'!Y2,IF('Cup Draw'!Z2<'Cup Draw'!AB2,'Cup Draw'!AC2)))","v":""},{"$f":"RAND()","v":0.62079170565808894},{"$f":"RANK(V2,$V$2:$V$5)+COUNTIF(W$1:W1,W1)-1","v":3},{"$f":"IF('Cup Draw'!AF2=\"\",\"\",IF('Cup Draw'!AF2>'Cup Draw'!AH2,'Cup Draw'!AE2,IF('Cup Draw'!AF2<'Cup Draw'!AH2,'Cup Draw'!AI2)))","v":""},{"$f":"RAND()","v":0.32043476668428006},{"$f":"RANK(Y2,$Y$2:$Y$3)+COUNTIF(Z$1:Z1,Z1)-1","v":1},{"$f":"IF('Cup Draw'!AL2=\"\",\"\",IF('Cup Draw'!AL2>'Cup Draw'!AN2,'Cup Draw'!AK2,IF('Cup Draw'!AL2<'Cup Draw'!AN2,'Cup Draw'!AO2)))","v":""}]
[2,null,null,{"$f":"RAND()","v":0.35591279377291318},{"$f":"RANK(D3,$D$2:$D$81)+COUNTIF(E$1:E2,E2)-1","v":52},"Bournemouth",{"$f":"RAND()","v":0.21745497188577267},{"$f":"RANK(G3,$G$2:$G$41)+COUNTIF(H$1:H2,H2)-1","v":33},{"$f":"IF('Cup Draw'!B3=\"\",\"\",IF('Cup Draw'!B3>'Cup Draw'!D3,'Cup Draw'!A3,IF('Cup Draw'!B3<'Cup Draw'!D3,'Cup Draw'!E3)))","v":""},{"$f":"RAND()","v":0.72935008110919952},{"$f":"RANK(J3,$J$2:$J$65)+COUNTIF(K$1:K2,K2)-1","v":17},{"$f":"IF('Cup Draw'!H3=\"\",\"\",IF('Cup Draw'!H3>'Cup Draw'!J3,'Cup Draw'!G3,IF('Cup Draw'!H3<'Cup Draw'!J3,'Cup Draw'!K3)))","v":""},{"$f":"RAND()","v":0.90210053736166573},{"$f":"RANK(M3,$M$2:$M$33)+COUNTIF(N$1:N2,N2)-1","v":2},{"$f":"IF('Cup Draw'!N3=\"\",\"\",IF('Cup Draw'!N3>'Cup Draw'!P3,'Cup Draw'!M3,IF('Cup Draw'!N3<'Cup Draw'!P3,'Cup Draw'!Q3)))","v":""},{"$f":"RAND()","v":0.37957926759032112},{"$f":"RANK(P3,$P$2:$P$17)+COUNTIF(Q$1:Q2,Q2)-1","v":10},{"$f":"IF('Cup Draw'!T3=\"\",\"\",IF('Cup Draw'!T3>'Cup Draw'!V3,'Cup Draw'!S3,IF('Cup Draw'!T3<'Cup Draw'!V3,'Cup Draw'!W3)))","v":""},{"$f":"RAND()","v":0.25456144029723271},{"$f":"RANK(S3,$S$2:$S$9)+COUNTIF(T$1:T2,T2)-1","v":5},{"$f":"IF('Cup Draw'!Z3=\"\",\"\",IF('Cup Draw'!Z3>'Cup Draw'!AB3,'Cup Draw'!Y3,IF('Cup Draw'!Z3<'Cup Draw'!AB3,'Cup Draw'!AC3)))","v":""},{"$f":"RAND()","v":0.79998116169802025},{"$f":"RANK(V3,$V$2:$V$5)+COUNTIF(W$1:W2,W2)-1","v":2},{"$f":"IF('Cup Draw'!AF3=\"\",\"\",IF('Cup Draw'!AF3>'Cup Draw'!AH3,'Cup Draw'!AE3,IF('Cup Draw'!AF3<'Cup Draw'!AH3,'Cup Draw'!AI3)))","v":""},{"$f":"RAND()","v":1.3523019609379738E-2},{"$f":"RANK(Y3,$Y$2:$Y$3)+COUNTIF(Z$1:Z2,Z2)-1","v":2},{"$f":"IF('Cup Draw'!AL3=\"\",\"\",IF('Cup Draw'!AL3>'Cup Draw'!AN3,'Cup Draw'!AK3,IF('Cup Draw'!AL3<'Cup Draw'!AN3,'Cup Draw'!AO3)))","v":""}]
[3,null,null,0.95103944644991956,{"$f":"RANK(D4,$D$2:$D$81)+COUNTIF(E$1:E3,E3)-1","v":4},"Huddersfield",0.16341165886665643,{"$f":"RANK(G4,$G$2:$G$41)+COUNTIF(H$1:H3,H3)-1","v":36},{"$f":"IF('Cup Draw'!B4=\"\",\"\",IF('Cup Draw'!B4>'Cup Draw'!D4,'Cup Draw'!A4,IF('Cup Draw'!B4<'Cup Draw'!D4,'Cup Draw'!E4)))","v":""},0.72099636742309992,{"$f":"RANK(J4,$J$2:$J$65)+COUNTIF(K$1:K3,K3)-1","v":19},{"$f":"IF('Cup Draw'!H4=\"\",\"\",IF('Cup Draw'!H4>'Cup Draw'!J4,'Cup Draw'!G4,IF('Cup Draw'!H4<'Cup Draw'!J4,'Cup Draw'!K4)))","v":""},0.11110905918545511,{"$f":"RANK(M4,$M$2:$M$33)+COUNTIF(N$1:N3,N3)-1","v":29},{"$f":"IF('Cup Draw'!N4=\"\",\"\",IF('Cup Draw'!N4>'Cup Draw'!P4,'Cup Draw'!M4,IF('Cup Draw'!N4<'Cup Draw'!P4,'Cup Draw'!Q4)))","v":""},0.93550019855122912,{"$f":"RANK(P4,$P$2:$P$17)+COUNTIF(Q$1:Q3,Q3)-1","v":1},{"$f":"IF('Cup Draw'!T4=\"\",\"\",IF('Cup Draw'!T4>'Cup Draw'!V4,'Cup Draw'!S4,IF('Cup Draw'!T4<'Cup Draw'!V4,'Cup Draw'!W4)))","v":""},0.65372858568454129,{"$f":"RANK(S4,$S$2:$S$9)+COUNTIF(T$1:T3,T3)-1","v":3},{"$f":"IF('Cup Draw'!Z4=\"\",\"\",IF('Cup Draw'!Z4>'Cup Draw'!AB4,'Cup Draw'!Y4,IF('Cup Draw'!Z4<'Cup Draw'!AB4,'Cup Draw'!AC4)))","v":""},0.99822459703165534,{"$f":"RANK(V4,$V$2:$V$5)+COUNTIF(W$1:W3,W3)-1","v":1},{"$f":"IF('Cup Draw'!AF4=\"\",\"\",IF('Cup Draw'!AF4>'Cup Draw'!AH4,'Cup Draw'!AE4,IF('Cup Draw'!AF4<'Cup Draw'!AH4,'Cup Draw'!AI4)))","v":""}]
[4,null,null,0.49583550652307129,{"$f":"RANK(D5,$D$2:$D$81)+COUNTIF(E$1:E4,E4)-1","v":40},"Southampton",0.42224376262238572,{"$f":"RANK(G5,$G$2:$G$41)+COUNTIF(H$1:H4,H4)-1","v":24},{"$f":"IF('Cup Draw'!B5=\"\",\"\",IF('Cup Draw'!B5>'Cup Draw'!D5,'Cup Draw'!A5,IF('Cup Draw'!B5<'Cup Draw'!D5,'Cup Draw'!E5)))","v":""},0.11724038374045054,{"$f":"RANK(J5,$J$2:$J$65)+COUNTIF(K$1:K4,K4)-1","v":56},{"$f":"IF('Cup Draw'!H5=\"\",\"\",IF('Cup Draw'!H5>'Cup Draw'!J5,'Cup Draw'!G5,IF('Cup Draw'!H5<'Cup Draw'!J5,'Cup Draw'!K5)))","v":""},1.2170862723294928E-2,{"$f":"RANK(M5,$M$2:$M$33)+COUNTIF(N$1:N4,N4)-1","v":31},{"$f":"IF('Cup Draw'!N5=\"\",\"\",IF('Cup Draw'!N5>'Cup Draw'!P5,'Cup Draw'!M5,IF('Cup Draw'!N5<'Cup Draw'!P5,'Cup Draw'!Q5)))","v":""},0.5400029614966958,{"$f":"RANK(P5,$P$2:$P$17)+COUNTIF(Q$1:Q4,Q4)-1","v":7},{"$f":"IF('Cup Draw'!T5=\"\",\"\",IF('Cup Draw'!T5>'Cup Draw'!V5,'Cup Draw'!S5,IF('Cup Draw'!T5<'Cup Draw'!V5,'Cup Draw'!W5)))","v":""},0.80424241807932939,{"$f":"RANK(S5,$S$2:$S$9)+COUNTIF(T$1:T4,T4)-1","v":2},{"$f":"IF('Cup Draw'!Z5=\"\",\"\",IF('Cup Draw'!Z5>'Cup Draw'!AB5,'Cup Draw'!Y5,IF('Cup Draw'!Z5<'Cup Draw'!AB5,'Cup Draw'!AC5)))","v":""},9.4574973836454745E-2,{"$f":"RANK(V5,$V$2:$V$5)+COUNTIF(W$1:W4,W4)-1","v":4},{"$f":"IF('Cup Draw'!AF5=\"\",\"\",IF('Cup Draw'!AF5>'Cup Draw'!AH5,'Cup Draw'!AE5,IF('Cup Draw'!AF5<'Cup Draw'!AH5,'Cup Draw'!AI5)))","v":""}]
[5,null,null,7.2339233692922389E-2,{"$f":"RANK(D6,$D$2:$D$81)+COUNTIF(E$1:E5,E5)-1","v":73},"Oldham",0.63122883133074281,{"$f":"RANK(G6,$G$2:$G$41)+COUNTIF(H$1:H5,H5)-1","v":9},{"$f":"IF('Cup Draw'!B6=\"\",\"\",IF('Cup Draw'!B6>'Cup Draw'!D6,'Cup Draw'!A6,IF('Cup Draw'!B6<'Cup Draw'!D6,'Cup Draw'!E6)))","v":""},0.18992544913040688,{"$f":"RANK(J6,$J$2:$J$65)+COUNTIF(K$1:K5,K5)-1","v":54},{"$f":"IF('Cup Draw'!H6=\"\",\"\",IF('Cup Draw'!H6>'Cup Draw'!J6,'Cup Draw'!G6,IF('Cup Draw'!H6<'Cup Draw'!J6,'Cup Draw'!K6)))","v":""},0.15390525226531959,{"$f":"RANK(M6,$M$2:$M$33)+COUNTIF(N$1:N5,N5)-1","v":26},{"$f":"IF('Cup Draw'!N6=\"\",\"\",IF('Cup Draw'!N6>'Cup Draw'!P6,'Cup Draw'!M6,IF('Cup Draw'!N6<'Cup Draw'!P6,'Cup Draw'!Q6)))","v":""},0.18830772172894161,{"$f":"RANK(P6,$P$2:$P$17)+COUNTIF(Q$1:Q5,Q5)-1","v":14},{"$f":"IF('Cup Draw'!T6=\"\",\"\",IF('Cup Draw'!T6>'Cup Draw'!V6,'Cup Draw'!S6,IF('Cup Draw'!T6<'Cup Draw'!V6,'Cup Draw'!W6)))","v":""},0.83950076811943408,{"$f":"RANK(S6,$S$2:$S$9)+COUNTIF(T$1:T5,T5)-1","v":1},{"$f":"IF('Cup Draw'!Z6=\"\",\"\",IF('Cup Draw'!Z6>'Cup Draw'!AB6,'Cup Draw'!Y6,IF('Cup Draw'!Z6<'Cup Draw'!AB6,'Cup Draw'!AC6)))","v":""}]
[6,null,null,0.86718050025091276,{"$f":"RANK(D7,$D$2:$D$81)+COUNTIF(E$1:E6,E6)-1","v":12},"Charlton",0.46574722656103051,{"$f":"RANK(G7,$G$2:$G$41)+COUNTIF(H$1:H6,H6)-1","v":21},{"$f":"IF('Cup Draw'!B7=\"\",\"\",IF('Cup Draw'!B7>'Cup Draw'!D7,'Cup Draw'!A7,IF('Cup Draw'!B7<'Cup Draw'!D7,'Cup Draw'!E7)))","v":""},1.687813778480618E-2,{"$f":"RANK(J7,$J$2:$J$65)+COUNTIF(K$1:K6,K6)-1","v":63},{"$f":"IF('Cup Draw'!H7=\"\",\"\",IF('Cup Draw'!H7>'Cup Draw'!J7,'Cup Draw'!G7,IF('Cup Draw'!H7<'Cup Draw'!J7,'Cup Draw'!K7)))","v":""},0.2611146992378387,{"$f":"RANK(M7,$M$2:$M$33)+COUNTIF(N$1:N6,N6)-1","v":22},{"$f":"IF('Cup Draw'!N7=\"\",\"\",IF('Cup Draw'!N7>'Cup Draw'!P7,'Cup Draw'!M7,IF('Cup Draw'!N7<'Cup Draw'!P7,'Cup Draw'!Q7)))","v":""},4.9561570603252059E-2,{"$f":"RANK(P7,$P$2:$P$17)+COUNTIF(Q$1:Q6,Q6)-1","v":16},{"$f":"IF('Cup Draw'!T7=\"\",\"\",IF('Cup Draw'!T7>'Cup Draw'!V7,'Cup Draw'!S7,IF('Cup Draw'!T7<'Cup Draw'!V7,'Cup Draw'!W7)))","v":""},0.12844315892263858,{"$f":"RANK(S7,$S$2:$S$9)+COUNTIF(T$1:T6,T6)-1","v":6},{"$f":"IF('Cup Draw'!Z7=\"\",\"\",IF('Cup Draw'!Z7>'Cup Draw'!AB7,'Cup Draw'!Y7,IF('Cup Draw'!Z7<'Cup Draw'!AB7,'Cup Draw'!AC7)))","v":""}]
[7,null,null,0.42888034741061976,{"$f":"RANK(D8,$D$2:$D$81)+COUNTIF(E$1:E7,E7)-1","v":49},"MK Dons",0.60649572430170551,{"$f":"RANK(G8,$G$2:$G$41)+COUNTIF(H$1:H7,H7)-1","v":13},{"$f":"IF('Cup Draw'!B8=\"\",\"\",IF('Cup Draw'!B8>'Cup Draw'!D8,'Cup Draw'!A8,IF('Cup Draw'!B8<'Cup Draw'!D8,'Cup Draw'!E8)))","v":""},0.97833764091304842,{"$f":"RANK(J8,$J$2:$J$65)+COUNTIF(K$1:K7,K7)-1","v":2},{"$f":"IF('Cup Draw'!H8=\"\",\"\",IF('Cup Draw'!H8>'Cup Draw'!J8,'Cup Draw'!G8,IF('Cup Draw'!H8<'Cup Draw'!J8,'Cup Draw'!K8)))","v":""},0.36738918026756773,{"$f":"RANK(M8,$M$2:$M$33)+COUNTIF(N$1:N7,N7)-1","v":19},{"$f":"IF('Cup Draw'!N8=\"\",\"\",IF('Cup Draw'!N8>'Cup Draw'!P8,'Cup Draw'!M8,IF('Cup Draw'!N8<'Cup Draw'!P8,'Cup Draw'!Q8)))","v":""},0.79665355447627628,{"$f":"RANK(P8,$P$2:$P$17)+COUNTIF(Q$1:Q7,Q7)-1","v":5},{"$f":"IF('Cup Draw'!T8=\"\",\"\",IF('Cup Draw'!T8>'Cup Draw'!V8,'Cup Draw'!S8,IF('Cup Draw'!T8<'Cup Draw'!V8,'Cup Draw'!W8)))","v":""},0.47298357835257332,{"$f":"RANK(S8,$S$2:$S$9)+COUNTIF(T$1:T7,T7)-1","v":4},{"$f":"IF('Cup Draw'!Z8=\"\",\"\",IF('Cup Draw'!Z8>'Cup Draw'!AB8,'Cup Draw'!Y8,IF('Cup Draw'!Z8<'Cup Draw'!AB8,'Cup Draw'!AC8)))","v":""}]
[8,null,null,0.60662617906490901,{"$f":"RANK(D9,$D$2:$D$81)+COUNTIF(E$1:E8,E8)-1","v":31},"Peterborough",0.30581301103161229,{"$f":"RANK(G9,$G$2:$G$41)+COUNTIF(H$1:H8,H8)-1","v":29},{"$f":"IF('Cup Draw'!B9=\"\",\"\",IF('Cup Draw'!B9>'Cup Draw'!D9,'Cup Draw'!A9,IF('Cup Draw'!B9<'Cup Draw'!D9,'Cup Draw'!E9)))","v":""},0.75047115783859286,{"$f":"RANK(J9,$J$2:$J$65)+COUNTIF(K$1:K8,K8)-1","v":14},{"$f":"IF('Cup Draw'!H9=\"\",\"\",IF('Cup Draw'!H9>'Cup Draw'!J9,'Cup Draw'!G9,IF('Cup Draw'!H9<'Cup Draw'!J9,'Cup Draw'!K9)))","v":""},0.46387577878617225,{"$f":"RANK(M9,$M$2:$M$33)+COUNTIF(N$1:N8,N8)-1","v":17},{"$f":"IF('Cup Draw'!N9=\"\",\"\",IF('Cup Draw'!N9>'Cup Draw'!P9,'Cup Draw'!M9,IF('Cup Draw'!N9<'Cup Draw'!P9,'Cup Draw'!Q9)))","v":""},0.82130678540024926,{"$f":"RANK(P9,$P$2:$P$17)+COUNTIF(Q$1:Q8,Q8)-1","v":4},{"$f":"IF('Cup Draw'!T9=\"\",\"\",IF('Cup Draw'!T9>'Cup Draw'!V9,'Cup Draw'!S9,IF('Cup Draw'!T9<'Cup Draw'!V9,'Cup Draw'!W9)))","v":""},4.3831596668670647E-2,{"$f":"RANK(S9,$S$2:$S$9)+COUNTIF(T$1:T8,T8)-1","v":8},{"$f":"IF('Cup Draw'!Z9=\"\",\"\",IF('Cup Draw'!Z9>'Cup Draw'!AB9,'Cup Draw'!Y9,IF('Cup Draw'!Z9<'Cup Draw'!AB9,'Cup Draw'!AC9)))","v":""}]
[9,null,null,0.11477561258383795,{"$f":"RANK(D10,$D$2:$D$81)+COUNTIF(E$1:E9,E9)-1","v":69},"Rochdale",0.62881866221285032,{"$f":"RANK(G10,$G$2:$G$41)+COUNTIF(H$1:H9,H9)-1","v":10},{"$f":"IF('Cup Draw'!B10=\"\",\"\",IF('Cup Draw'!B10>'Cup Draw'!D10,'Cup Draw'!A10,IF('Cup Draw'!B10<'Cup Draw'!D10,'Cup Draw'!E10)))","v":""},0.20170003426344696,{"$f":"RANK(J10,$J$2:$J$65)+COUNTIF(K$1:K9,K9)-1","v":53},{"$f":"IF('Cup Draw'!H10=\"\",\"\",IF('Cup Draw'!H10>'Cup Draw'!J10,'Cup Draw'!G10,IF('Cup Draw'!H10<'Cup Draw'!J10,'Cup Draw'!K10)))","v":""},0.10801349336614363,{"$f":"RANK(M10,$M$2:$M$33)+COUNTIF(N$1:N9,N9)-1","v":30},{"$f":"IF('Cup Draw'!N10=\"\",\"\",IF('Cup Draw'!N10>'Cup Draw'!P10,'Cup Draw'!M10,IF('Cup Draw'!N10<'Cup Draw'!P10,'Cup Draw'!Q10)))","v":""},0.90004710241442865,{"$f":"RANK(P10,$P$2:$P$17)+COUNTIF(Q$1:Q9,Q9)-1","v":2},{"$f":"IF('Cup Draw'!T10=\"\",\"\",IF('Cup Draw'!T10>'Cup Draw'!V10,'Cup Draw'!S10,IF('Cup Draw'!T10<'Cup Draw'!V10,'Cup Draw'!W10)))","v":""}]
{"$rows_left_out":72}
{"sheet":"Cup Draw","index":1,"n_rows":41,"n_cols":49,"rows_kept":41,"cut":false,"hidden":false,"merged":[]}
["First Round",null,null,null,null,null,"Second Round",null,null,null,null,null,"Third Round",null,null,null,null,null,"Fourth Round",null,null,null,null,null,"Fifth Round",null,null,null,null,null,"Quarter Finals",null,null,null,null,null,"Semi Final",null,null,null,null,null,"Final",null,null,null,null,null,"Winner"]
[{"$f":"VLOOKUP(Data!$A2,Data!$E$2:$F$81,2,FALSE)","v":"Bristol Rovers"},null,"v",null,{"$f":"VLOOKUP(Data!$A42,Data!$E$2:$F$81,2,FALSE)","v":"Grimsby Town"},null,{"$f":"VLOOKUP(Data!$A2,Data!$H$2:$I$41,2,FALSE)","v":""},null,"v",null,{"$f":"VLOOKUP(Data!$A22,Data!$H$2:$I$41,2,FALSE)","v":""},null,{"$f":"VLOOKUP(Data!$A2,Data!$K$2:$L$65,2,FALSE)","v":""},null,"v",null,{"$f":"VLOOKUP(Data!$A34,Data!$K$2:$L$65,2,FALSE)","v":""},null,{"$f":"VLOOKUP(Data!$A2,Data!$N$2:$O$33,2,FALSE)","v":""},null,"v",null,{"$f":"VLOOKUP(Data!$A18,Data!$N$2:$O$33,2,FALSE)","v":""},null,{"$f":"VLOOKUP(Data!$A2,Data!$Q$2:$R$17,2,FALSE)","v":""},null,"v",null,{"$f":"VLOOKUP(Data!$A10,Data!$Q$2:$R$17,2,FALSE)","v":""},null,{"$f":"VLOOKUP(Data!$A2,Data!$T$2:$U$9,2,FALSE)","v":""},null,"v",null,{"$f":"VLOOKUP(Data!$A6,Data!$T$2:$U$9,2,FALSE)","v":""},null,{"$f":"VLOOKUP(Data!$A2,Data!$W$2:$X$5,2,FALSE)","v":""},null,"v",null,{"$f":"VLOOKUP(Data!$A4,Data!$W$2:$X$5,2,FALSE)","v":""},null,{"$f":"VLOOKUP(Data!$A2,Data!$Z$2:$AA$3,2,FALSE)","v":""},null,"v",null,{"$f":"VLOOKUP(Data!$A3,Data!$Z$2:$AA$3,2,FALSE)","v":""},null,{"$f":"IF(AR2=\"\",\"\",IF(AR2>AT2,AQ2,IF(AR2<AT2,AU2)))","v":""}]
[{"$f":"VLOOKUP(Data!$A3,Data!$E$2:$F$81,2,FALSE)","v":"Bath City"},null,"v",null,{"$f":"VLOOKUP(Data!$A43,Data!$E$2:$F$81,2,FALSE)","v":"Droylsden"},null,{"$f":"VLOOKUP(Data!$A3,Data!$H$2:$I$41,2,FALSE)","v":""},null,"v",null,{"$f":"VLOOKUP(Data!$A23,Data!$H$2:$I$41,2,FALSE)","v":""},null,{"$f":"VLOOKUP(Data!$A3,Data!$K$2:$L$65,2,FALSE)","v":""},null,"v",null,{"$f":"VLOOKUP(Data!$A35,Data!$K$2:$L$65,2,FALSE)","v":""},null,{"$f":"VLOOKUP(Data!$A3,Data!$N$2:$O$33,2,FALSE)","v":""},null,"v",null,{"$f":"VLOOKUP(Data!$A19,Data!$N$2:$O$33,2,FALSE)","v":""},null,{"$f":"VLOOKUP(Data!$A3,Data!$Q$2:$R$17,2,FALSE)","v":""},null,"v",null,{"$f":"VLOOKUP(Data!$A11,Data!$Q$2:$R$17,2,FALSE)","v":""},null,{"$f":"VLOOKUP(Data!$A3,Data!$T$2:$U$9,2,FALSE)","v":""},null,"v",null,{"$f":"VLOOKUP(Data!$A7,Data!$T$2:$U$9,2,FALSE)","v":""},null,{"$f":"VLOOKUP(Data!$A3,Data!$W$2:$X$5,2,FALSE)","v":""},null,"v",null,{"$f":"VLOOKUP(Data!$A5,Data!$W$2:$X$5,2,FALSE)","v":""}]
[{"$f":"VLOOKUP(Data!$A4,Data!$E$2:$F$81,2,FALSE)","v":"Crewe"},null,"v",null,{"$f":"VLOOKUP(Data!$A44,Data!$E$2:$F$81,2,FALSE)","v":"Hereford"},null,{"$f":"VLOOKUP(Data!$A4,Data!$H$2:$I$41,2,FALSE)","v":""},null,"v",null,{"$f":"VLOOKUP(Data!$A24,Data!$H$2:$I$41,2,FALSE)","v":""},null,{"$f":"VLOOKUP(Data!$A4,Data!$K$2:$L$65,2,FALSE)","v":""},null,"v",null,{"$f":"VLOOKUP(Data!$A36,Data!$K$2:$L$65,2,FALSE)","v":""},null,{"$f":"VLOOKUP(Data!$A4,Data!$N$2:$O$33,2,FALSE)","v":""},null,"v",null,{"$f":"VLOOKUP(Data!$A20,Data!$N$2:$O$33,2,FALSE)","v":""},null,{"$f":"VLOOKUP(Data!$A4,Data!$Q$2:$R$17,2,FALSE)","v":""},null,"v",null,{"$f":"VLOOKUP(Data!$A12,Data!$Q$2:$R$17,2,FALSE)","v":""},null,{"$f":"VLOOKUP(Data!$A4,Data!$T$2:$U$9,2,FALSE)","v":""},null,"v",null,{"$f":"VLOOKUP(Data!$A8,Data!$T$2:$U$9,2,FALSE)","v":""}]
[{"$f":"VLOOKUP(Data!$A5,Data!$E$2:$F$81,2,FALSE)","v":"Huddersfield"},null,"v",null,{"$f":"VLOOKUP(Data!$A45,Data!$E$2:$F$81,2,FALSE)","v":"Workington"},null,{"$f":"VLOOKUP(Data!$A5,Data!$H$2:$I$41,2,FALSE)","v":""},null,"v",null,{"$f":"VLOOKUP(Data!$A25,Data!$H$2:$I$41,2,FALSE)","v":""},null,{"$f":"VLOOKUP(Data!$A5,Data!$K$2:$L$65,2,FALSE)","v":""},null,"v",null,{"$f":"VLOOKUP(Data!$A37,Data!$K$2:$L$65,2,FALSE)","v":""},null,{"$f":"VLOOKUP(Data!$A5,Data!$N$2:$O$33,2,FALSE)","v":""},null,"v",null,{"$f":"VLOOKUP(Data!$A21,Data!$N$2:$O$33,2,FALSE)","v":""},null,{"$f":"VLOOKUP(Data!$A5,Data!$Q$2:$R$17,2,FALSE)","v":""},null,"v",null,{"$f":"VLOOKUP(Data!$A13,Data!$Q$2:$R$17,2,FALSE)","v":""},null,{"$f":"VLOOKUP(Data!$A5,Data!$T$2:$U$9,2,FALSE)","v":""},null,"v",null,{"$f":"VLOOKUP(Data!$A9,Data!$T$2:$U$9,2,FALSE)","v":""}]
[{"$f":"VLOOKUP(Data!$A6,Data!$E$2:$F$81,2,FALSE)","v":"Ebbsfleet United"},null,"v",null,{"$f":"VLOOKUP(Data!$A46,Data!$E$2:$F$81,2,FALSE)","v":"Chesterfield"},null,{"$f":"VLOOKUP(Data!$A6,Data!$H$2:$I$41,2,FALSE)","v":""},null,"v",null,{"$f":"VLOOKUP(Data!$A26,Data!$H$2:$I$41,2,FALSE)","v":""},null,{"$f":"VLOOKUP(Data!$A6,Data!$K$2:$L$65,2,FALSE)","v":""},null,"v",null,{"$f":"VLOOKUP(Data!$A38,Data!$K$2:$L$65,2,FALSE)","v":""},null,{"$f":"VLOOKUP(Data!$A6,Data!$N$2:$O$33,2,FALSE)","v":""},null,"v",null,{"$f":"VLOOKUP(Data!$A22,Data!$N$2:$O$33,2,FALSE)","v":""},null,{"$f":"VLOOKUP(Data!$A6,Data!$Q$2:$R$17,2,FALSE)","v":""},null,"v",null,{"$f":"VLOOKUP(Data!$A14,Data!$Q$2:$R$17,2,FALSE)","v":""}]
[{"$f":"VLOOKUP(Data!$A7,Data!$E$2:$F$81,2,FALSE)","v":"FC United of Manchester"},null,"v",null,{"$f":"VLOOKUP(Data!$A47,Data!$E$2:$F$81,2,FALSE)","v":"Nuneaton Town"},null,{"$f":"VLOOKUP(Data!$A7,Data!$H$2:$I$41,2,FALSE)","v":""},null,"v",null,{"$f":"VLOOKUP(Data!$A27,Data!$H$2:$I$41,2,FALSE)","v":""},null,{"$f":"VLOOKUP(Data!$A7,Data!$K$2:$L$65,2,FALSE)","v":""},null,"v",null,{"$f":"VLOOKUP(Data!$A39,Data!$K$2:$L$65,2,FALSE)","v":""},null,{"$f":"VLOOKUP(Data!$A7,Data!$N$2:$O$33,2,FALSE)","v":""},null,"v",null,{"$f":"VLOOKUP(Data!$A23,Data!$N$2:$O$33,2,FALSE)","v":""},null,{"$f":"VLOOKUP(Data!$A7,Data!$Q$2:$R$17,2,FALSE)","v":""},null,"v",null,{"$f":"VLOOKUP(Data!$A15,Data!$Q$2:$R$17,2,FALSE)","v":""}]
[{"$f":"VLOOKUP(Data!$A8,Data!$E$2:$F$81,2,FALSE)","v":"Rotherham"},null,"v",null,{"$f":"VLOOKUP(Data!$A48,Data!$E$2:$F$81,2,FALSE)","v":"Chelmsford City"},null,{"$f":"VLOOKUP(Data!$A8,Data!$H$2:$I$41,2,FALSE)","v":""},null,"v",null,{"$f":"VLOOKUP(Data!$A28,Data!$H$2:$I$41,2,FALSE)","v":""},null,{"$f":"VLOOKUP(Data!$A8,Data!$K$2:$L$65,2,FALSE)","v":""},null,"v",null,{"$f":"VLOOKUP(Data!$A40,Data!$K$2:$L$65,2,FALSE)","v":""},null,{"$f":"VLOOKUP(Data!$A8,Data!$N$2:$O$33,2,FALSE)","v":""},null,"v",null,{"$f":"VLOOKUP(Data!$A24,Data!$N$2:$O$33,2,FALSE)","v":""},null,{"$f":"VLOOKUP(Data!$A8,Data!$Q$2:$R$17,2,FALSE)","v":""},null,"v",null,{"$f":"VLOOKUP(Data!$A16,Data!$Q$2:$R$17,2,FALSE)","v":""}]
[{"$f":"VLOOKUP(Data!$A9,Data!$E$2:$F$81,2,FALSE)","v":"Southend"},null,"v",null,{"$f":"VLOOKUP(Data!$A49,Data!$E$2:$F$81,2,FALSE)","v":"Gillingham"},null,{"$f":"VLOOKUP(Data!$A9,Data!$H$2:$I$41,2,FALSE)","v":""},null,"v",null,{"$f":"VLOOKUP(Data!$A29,Data!$H$2:$I$41,2,FALSE)","v":""},null,{"$f":"VLOOKUP(Data!$A9,Data!$K$2:$L$65,2,FALSE)","v":""},null,"v",null,{"$f":"VLOOKUP(Data!$A41,Data!$K$2:$L$65,2,FALSE)","v":""},null,{"$f":"VLOOKUP(Data!$A9,Data!$N$2:$O$33,2,FALSE)","v":""},null,"v",null,{"$f":"VLOOKUP(Data!$A25,Data!$N$2:$O$33,2,FALSE)","v":""},null,{"$f":"VLOOKUP(Data!$A9,Data!$Q$2:$R$17,2,FALSE)","v":""},null,"v",null,{"$f":"VLOOKUP(Data!$A17,Data!$Q$2:$R$17,2,FALSE)","v":""}]
[{"$f":"VLOOKUP(Data!$A10,Data!$E$2:$F$81,2,FALSE)","v":"Wycombe"},null,"v",null,{"$f":"VLOOKUP(Data!$A50,Data!$E$2:$F$81,2,FALSE)","v":"MK Dons"},null,{"$f":"VLOOKUP(Data!$A10,Data!$H$2:$I$41,2,FALSE)","v":""},null,"v",null,{"$f":"VLOOKUP(Data!$A30,Data!$H$2:$I$41,2,FALSE)","v":""},null,{"$f":"VLOOKUP(Data!$A10,Data!$K$2:$L$65,2,FALSE)","v":""},null,"v",null,{"$f":"VLOOKUP(Data!$A42,Data!$K$2:$L$65,2,FALSE)","v":""},null,{"$f":"VLOOKUP(Data!$A10,Data!$N$2:$O$33,2,FALSE)","v":""},null,"v",null,{"$f":"VLOOKUP(Data!$A26,Data!$N$2:$O$33,2,FALSE)","v":""}]
{"$rows_left_out":31}