{"text_format":"1","workbook":"xlsx","n_sheets":8,"sheets":["Teams","Home","Away","Fixtures","Calculations","League Table","Random","Data"],"not_rendered":{"charts":0,"images":0,"macros":1,"external_links":0,"defined_names":0,"comments":0,"pivot_tables":0},"unopened":[],"bounds":{"document_bytes":16777216,"sheet_cells":100000,"rows_first":2000,"rows_last":500,"rows_between":2000,"halvings":0,"cell_chars":16384,"cell_head_chars":4096},"cells_cut":0,"cells_raw":0,"read":"whole","date_system":"1900"}

{"sheet":"Teams","index":0,"n_rows":21,"n_cols":5,"rows_kept":21,"cut":false,"hidden":false,"merged":[]}
["Teams"]
["Arsenal",null,null,null,"How many times do each team play each other"]
["Aston Villa",null,null,null,2]
["Blackburn Rovers"]
["Bolton Wanderers",null,null,null,"Number of teams"]
["Chelsea",null,null,null,{"$f":"COUNTA(A2:A51)","v":20}]
["Everton"]
["Fulham"]
["Liverpool"]
["Manchester City"]
["Manchester United",null,null,null,"Created by"]
["Newcastle United",null,null,null,"www.computergaga.com"]
["Norwich"]
["Queens Park Rangers"]
["Stoke City"]
["Sunderland"]
["Swansea City"]
["Tottenham Hotspur"]
["West Bromwich Albion"]
["Wigan Athletic"]
["Wolves"]

{"sheet":"Home","index":1,"n_rows":20,"n_cols":20,"rows_kept":20,"cut":false,"hidden":true,"merged":[]}
[null,"Bolton Wanderers","Swansea City","Manchester City","Queens Park Rangers","Tottenham Hotspur","Stoke City","West Bromwich Albion","Everton","Norwich","Blackburn Rovers","Manchester United","Sunderland","Aston Villa","Newcastle United","Wolves","Fulham","Liverpool","Chelsea","Arsenal"]
["Swansea City",1]
["Manchester City",2,3]
["Queens Park Rangers",3,4,5]
["Tottenham Hotspur",4,5,6,7]
["Stoke City",5,6,7,8,9]
["West Bromwich Albion",6,7,8,9,10,11]
["Everton",7,8,9,10,11,12,13]
["Norwich",8,9,10,11,12,13,14,15]
["Blackburn Rovers",9,10,11,12,13,14,15,16,17]
["Manchester United",10,11,12,13,14,15,16,17,18,19]
["Sunderland",11,12,13,14,15,16,17,18,19,1,2]
["Aston Villa",12,13,14,15,16,17,18,19,1,2,3,4]
["Newcastle United",13,14,15,16,17,18,19,1,2,3,4,5,6]
["Wolves",14,15,16,17,18,19,1,2,3,4,5,6,7,8]
["Fulham",15,16,17,18,19,1,2,3,4,5,6,7,8,9,10]
["Liverpool",16,17,18,19,1,2,3,4,5,6,7,8,9,10,11,12]
["Chelsea",17,18,19,1,2,3,4,5,6,7,8,9,10,11,12,13,14]
["Arsenal",18,19,1,2,3,4,5,6,7,8,9,10,11,12,13,14,15,16]
["Wigan Athletic",19,2,4,6,8,10,12,14,16,18,1,3,5,7,9,11,13,15,17]

{"sheet":"Away","index":2,"n_rows":20,"n_cols":20,"rows_kept":20,"cut":false,"hidden":true,"merged":[]}
[null,"Bolton Wanderers","Swansea City","Manchester City","Queens Park Rangers","Tottenham Hotspur","Stoke City","West Bromwich Albion","Everton","Norwich","Blackburn Rovers","Manchester United","Sunderland","Aston Villa","Newcastle United","Wolves","Fulham","Liverpool","Chelsea","Arsenal"]
["Swansea City",1]
["Manchester City",2,3]
["Queens Park Rangers",3,4,5]
["Tottenham Hotspur",4,5,6,7]
["Stoke City",5,6,7,8,9]
["West Bromwich Albion",6,7,8,9,10,11]
["Everton",7,8,9,10,11,12,13]
["Norwich",8,9,10,11,12,13,14,15]
["Blackburn Rovers",9,10,11,12,13,14,15,16,17]
["Manchester United",10,11,12,13,14,15,16,17,18,19]
["Sunderland",11,12,13,14,15,16,17,18,19,1,2]
["Aston Villa",12,13,14,15,16,17,18,19,1,2,3,4]
["Newcastle United",13,14,15,16,17,18,19,1,2,3,4,5,6]
["Wolves",14,15,16,17,18,19,1,2,3,4,5,6,7,8]
["Fulham",15,16,17,18,19,1,2,3,4,5,6,7,8,9,10]
["Liverpool",16,17,18,19,1,2,3,4,5,6,7,8,9,10,11,12]
["Chelsea",17,18,19,1,2,3,4,5,6,7,8,9,10,11,12,13,14]
["Arsenal",18,19,1,2,3,4,5,6,7,8,9,10,11,12,13,14,15,16]
["Wigan Athletic",19,2,4,6,8,10,12,14,16,18,1,3,5,7,9,11,13,15,17]

{"sheet":"Fixtures","index":3,"n_rows":455,"n_cols":7,"rows_kept":455,"cut":false,"hidden":false,"merged":[]}
["Week 1 Fixtures"]
["Swansea City",null,"v",null,"Bolton Wanderers",null,"Created by"]
["Arsenal",null,"v",null,"Manchester City",null,"www.computergaga.com"]
["Chelsea",null,"v",null,"Queens Park Rangers"]
["Liverpool",null,"v",null,"Tottenham Hotspur"]
["Fulham",null,"v",null,"Stoke City"]
["Wolves",null,"v",null,"West Bromwich Albion"]
["Newcastle United",null,"v",null,"Everton"]
["Aston Villa",null,"v",null,"Norwich"]
["Sunderland",null,"v",null,"Blackburn Rovers"]
["Wigan Athletic",null,"v",null,"Manchester United"]
[]
["Week 2 Fixtures"]
["Manchester City",null,"v",null,"Bolton Wanderers"]
["Wigan Athletic",null,"v",null,"Swansea City"]
["Arsenal",null,"v",null,"Queens Park Rangers"]
["Chelsea",null,"v",null,"Tottenham Hotspur"]
["Liverpool",null,"v",null,"Stoke City"]
["Fulham",null,"v",null,"West Bromwich Albion"]
["Wolves",null,"v",null,"Everton"]
["Newcastle United",null,"v",null,"Norwich"]
["Aston Villa",null,"v",null,"Blackburn Rovers"]
["Sunderland",null,"v",null,"Manchester United"]
[]
["Week 3 Fixtures"]
["Queens Park Rangers",null,"v",null,"Bolton Wanderers"]
["Manchester City",null,"v",null,"Swansea City"]
["Arsenal",null,"v",null,"Tottenham Hotspur"]
["Chelsea",null,"v",null,"Stoke City"]
["Liverpool",null,"v",null,"West Bromwich Albion"]
["Fulham",null,"v",null,"Everton"]
["Wolves",null,"v",null,"Norwich"]
["Newcastle United",null,"v",null,"Blackburn Rovers"]
["Aston Villa",null,"v",null,"Manchester United"]
["Wigan Athletic",null,"v",null,"Sunderland"]
[]
["Week 4 Fixtures"]
["Tottenham Hotspur",null,"v",null,"Bolton Wanderers"]
["Queens Park Rangers",null,"v",null,"Swansea City"]
["Wigan Athletic",null,"v",null,"Manchester City"]
["Arsenal",null,"v",null,"Stoke City"]
["Chelsea",null,"v",null,"West Bromwich Albion"]
["Liverpool",null,"v",null,"Everton"]
["Fulham",null,"v",null,"Norwich"]
["Wolves",null,"v",null,"Blackburn Rovers"]
["Newcastle United",null,"v",null,"Manchester United"]
["Aston Villa",null,"v",null,"Sunderland"]
[]
["Week 5 Fixtures"]
["Stoke City",null,"v",null,"Bolton Wanderers"]
["Tottenham Hotspur",null,"v",null,"Swansea City"]
["Queens Park Rangers",null,"v",null,"Manchester City"]
["Arsenal",null,"v",null,"West Bromwich Albion"]
["Chelsea",null,"v",null,"Everton"]
["Liverpool",null,"v",null,"Norwich"]
["Fulham",null,"v",null,"Blackburn Rovers"]
["Wolves",null,"v",null,"Manchester United"]
["Newcastle United",null,"v",null,"Sunderland"]
["Wigan Athletic",null,"v",null,"Aston Villa"]
[]
["Week 6 Fixtures"]
["West Bromwich Albion",null,"v",null,"Bolton Wanderers"]
["Stoke City",null,"v",null,"Swansea City"]
["Tottenham Hotspur",null,"v",null,"Manchester City"]
["Wigan Athletic",null,"v",null,"Queens Park Rangers"]
["Arsenal",null,"v",null,"Everton"]
["Chelsea",null,"v",null,"Norwich"]
["Liverpool",null,"v",null,"Blackburn Rovers"]
["Fulham",null,"v",null,"Manchester United"]
["Wolves",null,"v",null,"Sunderland"]
["Newcastle United",null,"v",null,"Aston Villa"]
[]
["Week 7 Fixtures"]
["Everton",null,"v",null,"Bolton Wanderers"]
["West Bromwich Albion",null,"v",null,"Swansea City"]
["Stoke City",null,"v",null,"Manchester City"]
["Tottenham Hotspur",null,"v",null,"Queens Park Rangers"]
["Arsenal",null,"v",null,"Norwich"]
["Chelsea",null,"v",null,"Blackburn Rovers"]
["Liverpool",null,"v",null,"Manchester United"]
["Fulham",null,"v",null,"Sunderland"]
["Wolves",null,"v",null,"Aston Villa"]
["Wigan Athletic",null,"v",null,"Newcastle United"]
[]
["Week 8 Fixtures"]
["Norwich",null,"v",null,"Bolton Wanderers"]
["Everton",null,"v",null,"Swansea City"]
["West Bromwich Albion",null,"v",null,"Manchester City"]
["Stoke City",null,"v",null,"Queens Park Rangers"]
["Wigan Athletic",null,"v",null,"Tottenham Hotspur"]
["Arsenal",null,"v",null,"Blackburn Rovers"]
["Chelsea",null,"v",null,"Manchester United"]
["Liverpool",null,"v",null,"Sunderland"]
["Fulham",null,"v",null,"Aston Villa"]
["Wolves",null,"v",null,"Newcastle United"]
[]
["Week 9 Fixtures"]
["Blackburn Rovers",null,"v",null,"Bolton Wanderers"]
["Norwich",null,"v",null,"Swansea City"]
["Everton",null,"v",null,"Manchester City"]
["West Bromwich Albion",null,"v",null,"Queens Park Rangers"]
["Stoke City",null,"v",null,"Tottenham Hotspur"]
["Arsenal",null,"v",null,"Manchester United"]
["Chelsea",null,"v",null,"Sunderland"]
["Liverpool",null,"v",null,"Aston Villa"]
["Fulham",null,"v",null,"Newcastle United"]
["Wigan Athletic",null,"v",null,"Wolves"]
[]
["Week 10 Fixtures"]
["Manchester United",null,"v",null,"Bolton Wanderers"]
["Blackburn Rovers",null,"v",null,"Swansea City"]
["Norwich",null,"v",null,"Manchester City"]
["Everton",null,"v",null,"Queens Park Rangers"]
["West Bromwich Albion",null,"v",null,"Tottenham Hotspur"]
["Wigan Athletic",null,"v",null,"Stoke City"]
["Arsenal",null,"v",null,"Sunderland"]
["Chelsea",null,"v",null,"Aston Villa"]
["Liverpool",null,"v",null,"Newcastle United"]
["Fulham",null,"v",null,"Wolves"]
[]
["Week 11 Fixtures"]
["Sunderland",null,"v",null,"Bolton Wanderers"]
["Manchester United",null,"v",null,"Swansea City"]
["Blackburn Rovers",null,"v",null,"Manchester City"]
["Norwich",null,"v",null,"Queens Park Rangers"]
["Everton",null,"v",null,"Tottenham Hotspur"]
["West Bromwich Albion",null,"v",null,"Stoke City"]
["Arsenal",null,"v",null,"Aston Villa"]
["Chelsea",null,"v",null,"Newcastle United"]
["Liverpool",null,"v",null,"Wolves"]
["Wigan Athletic",null,"v",null,"Fulham"]
[]
["Week 12 Fixtures"]
["Aston Villa",null,"v",null,"Bolton Wanderers"]
["Sunderland",null,"v",null,"Swansea City"]
["Manchester United",null,"v",null,"Manchester City"]
["Blackburn Rovers",null,"v",null,"Queens Park Rangers"]
["Norwich",null,"v",null,"Tottenham Hotspur"]
["Everton",null,"v",null,"Stoke City"]
["Wigan Athletic",null,"v",null,"West Bromwich Albion"]
["Arsenal",null,"v",null,"Newcastle United"]
["Chelsea",null,"v",null,"Wolves"]
["Liverpool",null,"v",null,"Fulham"]
[]
["Week 13 Fixtures"]
["Newcastle United",null,"v",null,"Bolton Wanderers"]
["Aston Villa",null,"v",null,"Swansea City"]
["Sunderland",null,"v",null,"Manchester City"]
["Manchester United",null,"v",null,"Queens Park Rangers"]
["Blackburn Rovers",null,"v",null,"Tottenham Hotspur"]
["Norwich",null,"v",null,"Stoke City"]
["Everton",null,"v",null,"West Bromwich Albion"]
["Arsenal",null,"v",null,"Wolves"]
["Chelsea",null,"v",null,"Fulham"]
["Wigan Athletic",null,"v",null,"Liverpool"]
[]
["Week 14 Fixtures"]
["Wolves",null,"v",null,"Bolton Wanderers"]
["Newcastle United",null,"v",null,"Swansea City"]
["Aston Villa",null,"v",null,"Manchester City"]
["Sunderland",null,"v",null,"Queens Park Rangers"]
["Manchester United",null,"v",null,"Tottenham Hotspur"]
["Blackburn Rovers",null,"v",null,"Stoke City"]
["Norwich",null,"v",null,"West Bromwich Albion"]
["Wigan Athletic",null,"v",null,"Everton"]
["Arsenal",null,"v",null,"Fulham"]
["Chelsea",null,"v",null,"Liverpool"]
[]
["Week 15 Fixtures"]
["Fulham",null,"v",null,"Bolton Wanderers"]
["Wolves",null,"v",null,"Swansea City"]
["Newcastle United",null,"v",null,"Manchester City"]
["Aston Villa",null,"v",null,"Queens Park Rangers"]
["Sunderland",null,"v",null,"Tottenham Hotspur"]
["Manchester United",null,"v",null,"Stoke City"]
["Blackburn Rovers",null,"v",null,"West Bromwich Albion"]
["Norwich",null,"v",null,"Everton"]
["Arsenal",null,"v",null,"Liverpool"]
["Wigan Athletic",null,"v",null,"Chelsea"]
[]
["Week 16 Fixtures"]
["Liverpool",null,"v",null,"Bolton Wanderers"]
["Fulham",null,"v",null,"Swansea City"]
["Wolves",null,"v",null,"Manchester City"]
["Newcastle United",null,"v",null,"Queens Park Rangers"]
["Aston Villa",null,"v",null,"Tottenham Hotspur"]
["Sunderland",null,"v",null,"Stoke City"]
["Manchester United",null,"v",null,"West Bromwich Albion"]
["Blackburn Rovers",null,"v",null,"Everton"]
["Wigan Athletic",null,"v",null,"Norwich"]
["Arsenal",null,"v",null,"Chelsea"]
[]
["Week 17 Fixtures"]
["Chelsea",null,"v",null,"Bolton Wanderers"]
["Liverpool",null,"v",null,"Swansea City"]
["Fulham",null,"v",null,"Manchester City"]
["Wolves",null,"v",null,"Queens Park Rangers"]
["Newcastle United",null,"v",null,"Tottenham Hotspur"]
["Aston Villa",null,"v",null,"Stoke City"]
["Sunderland",null,"v",null,"West Bromwich Albion"]
["Manchester United",null,"v",null,"Everton"]
["Blackburn Rovers",null,"v",null,"Norwich"]
["Wigan Athletic",null,"v",null,"Arsenal"]
[]
["Week 18 Fixtures"]
["Arsenal",null,"v",null,"Bolton Wanderers"]
["Chelsea",null,"v",null,"Swansea City"]
["Liverpool",null,"v",null,"Manchester City"]
["Fulham",null,"v",null,"Queens Park Rangers"]
["Wolves",null,"v",null,"Tottenham Hotspur"]
["Newcastle United",null,"v",null,"Stoke City"]
["Aston Villa",null,"v",null,"West Bromwich Albion"]
["Sunderland",null,"v",null,"Everton"]
["Manchester United",null,"v",null,"Norwich"]
["Wigan Athletic",null,"v",null,"Blackburn Rovers"]
[]
["Week 19 Fixtures"]
["Wigan Athletic",null,"v",null,"Bolton Wanderers"]
["Arsenal",null,"v",null,"Swansea City"]
["Chelsea",null,"v",null,"Manchester City"]
["Liverpool",null,"v",null,"Queens Park Rangers"]
["Fulham",null,"v",null,"Tottenham Hotspur"]
["Wolves",null,"v",null,"Stoke City"]
["Newcastle United",null,"v",null,"West Bromwich Albion"]
["Aston Villa",null,"v",null,"Everton"]
["Sunderland",null,"v",null,"Norwich"]
["Manchester United",null,"v",null,"Blackburn Rovers"]
[]
["Week 20 Fixtures"]
["Swansea City",null,"v",null,"Bolton Wanderers"]
["Arsenal",null,"v",null,"Manchester City"]
["Chelsea",null,"v",null,"Queens Park Rangers"]
["Liverpool",null,"v",null,"Tottenham Hotspur"]
["Fulham",null,"v",null,"Stoke City"]
["Wolves",null,"v",null,"West Bromwich Albion"]
["Newcastle United",null,"v",null,"Everton"]
["Aston Villa",null,"v",null,"Norwich"]
["Sunderland",null,"v",null,"Blackburn Rovers"]
["Wigan Athletic",null,"v",null,"Manchester United"]
[]
["Week 21 Fixtures"]
["Manchester City",null,"v",null,"Bolton Wanderers"]
["Wigan Athletic",null,"v",null,"Swansea City"]
["Arsenal",null,"v",null,"Queens Park Rangers"]
["Chelsea",null,"v",null,"Tottenham Hotspur"]
["Liverpool",null,"v",null,"Stoke City"]
["Fulham",null,"v",null,"West Bromwich Albion"]
["Wolves",null,"v",null,"Everton"]
["Newcastle United",null,"v",null,"Norwich"]
["Aston Villa",null,"v",null,"Blackburn Rovers"]
["Sunderland",null,"v",null,"Manchester United"]
[]
["Week 22 Fixtures"]
["Queens Park Rangers",null,"v",null,"Bolton Wanderers"]
["Manchester City",null,"v",null,"Swansea City"]
["Arsenal",null,"v",null,"Tottenham Hotspur"]
["Chelsea",null,"v",null,"Stoke City"]
["Liverpool",null,"v",null,"West Bromwich Albion"]
["Fulham",null,"v",null,"Everton"]
["Wolves",null,"v",null,"Norwich"]
["Newcastle United",null,"v",null,"Blackburn Rovers"]
["Aston Villa",null,"v",null,"Manchester United"]
["Wigan Athletic",null,"v",null,"Sunderland"]
[]
["Week 23 Fixtures"]
["Tottenham Hotspur",null,"v",null,"Bolton Wanderers"]
["Queens Park Rangers",null,"v",null,"Swansea City"]
["Wigan Athletic",null,"v",null,"Manchester City"]
["Arsenal",null,"v",null,"Stoke City"]
["Chelsea",null,"v",null,"West Bromwich Albion"]
["Liverpool",null,"v",null,"Everton"]
["Fulham",null,"v",null,"Norwich"]
["Wolves",null,"v",null,"Blackburn Rovers"]
["Newcastle United",null,"v",null,"Manchester United"]
["Aston Villa",null,"v",null,"Sunderland"]
[]
["Week 24 Fixtures"]
["Stoke City",null,"v",null,"Bolton Wanderers"]
["Tottenham Hotspur",null,"v",null,"Swansea City"]
["Queens Park Rangers",null,"v",null,"Manchester City"]
["Arsenal",null,"v",null,"West Bromwich Albion"]
["Chelsea",null,"v",null,"Everton"]
["Liverpool",null,"v",null,"Norwich"]
["Fulham",null,"v",null,"Blackburn Rovers"]
["Wolves",null,"v",null,"Manchester United"]
["Newcastle United",null,"v",null,"Sunderland"]
["Wigan Athletic",null,"v",null,"Aston Villa"]
[]
["Week 25 Fixtures"]
["West Bromwich Albion",null,"v",null,"Bolton Wanderers"]
["Stoke City",null,"v",null,"Swansea City"]
["Tottenham Hotspur",null,"v",null,"Manchester City"]
["Wigan Athletic",null,"v",null,"Queens Park Rangers"]
["Arsenal",null,"v",null,"Everton"]
["Chelsea",null,"v",null,"Norwich"]
["Liverpool",null,"v",null,"Blackburn Rovers"]
["Fulham",null,"v",null,"Manchester United"]
["Wolves",null,"v",null,"Sunderland"]
["Newcastle United",null,"v",null,"Aston Villa"]
[]
["Week 26 Fixtures"]
["Everton",null,"v",null,"Bolton Wanderers"]
["West Bromwich Albion",null,"v",null,"Swansea City"]
["Stoke City",null,"v",null,"Manchester City"]
["Tottenham Hotspur",null,"v",null,"Queens Park Rangers"]
["Arsenal",null,"v",null,"Norwich"]
["Chelsea",null,"v",null,"Blackburn Rovers"]
["Liverpool",null,"v",null,"Manchester United"]
["Fulham",null,"v",null,"Sunderland"]
["Wolves",null,"v",null,"Aston Villa"]
["Wigan Athletic",null,"v",null,"Newcastle United"]
[]
["Week 27 Fixtures"]
["Norwich",null,"v",null,"Bolton Wanderers"]
["Everton",null,"v",null,"Swansea City"]
["West Bromwich Albion",null,"v",null,"Manchester City"]
["Stoke City",null,"v",null,"Queens Park Rangers"]
["Wigan Athletic",null,"v",null,"Tottenham Hotspur"]
["Arsenal",null,"v",null,"Blackburn Rovers"]
["Chelsea",null,"v",null,"Manchester United"]
["Liverpool",null,"v",null,"Sunderland"]
["Fulham",null,"v",null,"Aston Villa"]
["Wolves",null,"v",null,"Newcastle United"]
[]
["Week 28 Fixtures"]
["Blackburn Rovers",null,"v",null,"Bolton Wanderers"]
["Norwich",null,"v",null,"Swansea City"]
["Everton",null,"v",null,"Manchester City"]
["West Bromwich Albion",null,"v",null,"Queens Park Rangers"]
["Stoke City",null,"v",null,"Tottenham Hotspur"]
["Arsenal",null,"v",null,"Manchester United"]
["Chelsea",null,"v",null,"Sunderland"]
["Liverpool",null,"v",null,"Aston Villa"]
["Fulham",null,"v",null,"Newcastle United"]
["Wigan Athletic",null,"v",null,"Wolves"]
[]
["Week 29 Fixtures"]
["Manchester United",null,"v",null,"Bolton Wanderers"]
["Blackburn Rovers",null,"v",null,"Swansea City"]
["Norwich",null,"v",null,"Manchester City"]
["Everton",null,"v",null,"Queens Park Rangers"]
["West Bromwich Albion",null,"v",null,"Tottenham Hotspur"]
["Wigan Athletic",null,"v",null,"Stoke City"]
["Arsenal",null,"v",null,"Sunderland"]
["Chelsea",null,"v",null,"Aston Villa"]
["Liverpool",null,"v",null,"Newcastle United"]
["Fulham",null,"v",null,"Wolves"]
[]
["Week 30 Fixtures"]
["Sunderland",null,"v",null,"Bolton Wanderers"]
["Manchester United",null,"v",null,"Swansea City"]
["Blackburn Rovers",null,"v",null,"Manchester City"]
["Norwich",null,"v",null,"Queens Park Rangers"]
["Everton",null,"v",null,"Tottenham Hotspur"]
["West Bromwich Albion",null,"v",null,"Stoke City"]
["Arsenal",null,"v",null,"Aston Villa"]
["Chelsea",null,"v",null,"Newcastle United"]
["Liverpool",null,"v",null,"Wolves"]
["Wigan Athletic",null,"v",null,"Fulham"]
[]
["Week 31 Fixtures"]
["Aston Villa",null,"v",null,"Bolton Wanderers"]
["Sunderland",null,"v",null,"Swansea City"]
["Manchester United",null,"v",null,"Manchester City"]
["Blackburn Rovers",null,"v",null,"Queens Park Rangers"]
["Norwich",null,"v",null,"Tottenham Hotspur"]
["Everton",null,"v",null,"Stoke City"]
["Wigan Athletic",null,"v",null,"West Bromwich Albion"]
["Arsenal",null,"v",null,"Newcastle United"]
["Chelsea",null,"v",null,"Wolves"]
["Liverpool",null,"v",null,"Fulham"]
[]
["Week 32 Fixtures"]
["Newcastle United",null,"v",null,"Bolton Wanderers"]
["Aston Villa",null,"v",null,"Swansea City"]
["Sunderland",null,"v",null,"Manchester City"]
["Manchester United",null,"v",null,"Queens Park Rangers"]
["Blackburn Rovers",null,"v",null,"Tottenham Hotspur"]
["Norwich",null,"v",null,"Stoke City"]
["Everton",null,"v",null,"West Bromwich Albion"]
["Arsenal",null,"v",null,"Wolves"]
["Chelsea",null,"v",null,"Fulham"]
["Wigan Athletic",null,"v",null,"Liverpool"]
[]
["Week 33 Fixtures"]
["Wolves",null,"v",null,"Bolton Wanderers"]
["Newcastle United",null,"v",null,"Swansea City"]
["Aston Villa",null,"v",null,"Manchester City"]
["Sunderland",null,"v",null,"Queens Park Rangers"]
["Manchester United",null,"v",null,"Tottenham Hotspur"]
["Blackburn Rovers",null,"v",null,"Stoke City"]
["Norwich",null,"v",null,"West Bromwich Albion"]
["Wigan Athletic",null,"v",null,"Everton"]
["Arsenal",null,"v",null,"Fulham"]
["Chelsea",null,"v",null,"Liverpool"]
[]
["Week 34 Fixtures"]
["Fulham",null,"v",null,"Bolton Wanderers"]
["Wolves",null,"v",null,"Swansea City"]
["Newcastle United",null,"v",null,"Manchester City"]
["Aston Villa",null,"v",null,"Queens Park Rangers"]
["Sunderland",null,"v",null,"Tottenham Hotspur"]
["Manchester United",null,"v",null,"Stoke City"]
["Blackburn Rovers",null,"v",null,"West Bromwich Albion"]
["Norwich",null,"v",null,"Everton"]
["Arsenal",null,"v",null,"Liverpool"]
["Wigan Athletic",null,"v",null,"Chelsea"]
[]
["Week 35 Fixtures"]
["Liverpool",null,"v",null,"Bolton Wanderers"]
["Fulham",null,"v",null,"Swansea City"]
["Wolves",null,"v",null,"Manchester City"]
["Newcastle United",null,"v",null,"Queens Park Rangers"]
["Aston Villa",null,"v",null,"Tottenham Hotspur"]
["Sunderland",null,"v",null,"Stoke City"]
["Manchester United",null,"v",null,"West Bromwich Albion"]
["Blackburn Rovers",null,"v",null,"Everton"]
["Wigan Athletic",null,"v",null,"Norwich"]
["Arsenal",null,"v",null,"Chelsea"]
[]
["Week 36 Fixtures"]
["Chelsea",null,"v",null,"Bolton Wanderers"]
["Liverpool",null,"v",null,"Swansea City"]
["Fulham",null,"v",null,"Manchester City"]
["Wolves",null,"v",null,"Queens Park Rangers"]
["Newcastle United",null,"v",null,"Tottenham Hotspur"]
["Aston Villa",null,"v",null,"Stoke City"]
["Sunderland",null,"v",null,"West Bromwich Albion"]
["Manchester United",null,"v",null,"Everton"]
["Blackburn Rovers",null,"v",null,"Norwich"]
["Wigan Athletic",null,"v",null,"Arsenal"]
[]
["Week 37 Fixtures"]
["Arsenal",null,"v",null,"Bolton Wanderers"]
["Chelsea",null,"v",null,"Swansea City"]
["Liverpool",null,"v",null,"Manchester City"]
["Fulham",null,"v",null,"Queens Park Rangers"]
["Wolves",null,"v",null,"Tottenham Hotspur"]
["Newcastle United",null,"v",null,"Stoke City"]
["Aston Villa",null,"v",null,"West Bromwich Albion"]
["Sunderland",null,"v",null,"Everton"]
["Manchester United",null,"v",null,"Norwich"]
["Wigan Athletic",null,"v",null,"Blackburn Rovers"]
[]
["Week 38 Fixtures"]
["Wigan Athletic",null,"v",null,"Bolton Wanderers"]
["Arsenal",null,"v",null,"Swansea City"]
["Chelsea",null,"v",null,"Manchester City"]
["Liverpool",null,"v",null,"Queens Park Rangers"]
["Fulham",null,"v",null,"Tottenham Hotspur"]
["Wolves",null,"v",null,"Stoke City"]
["Newcastle United",null,"v",null,"West Bromwich Albion"]
["Aston Villa",null,"v",null,"Everton"]
["Sunderland",null,"v",null,"Norwich"]
["Manchester United",null,"v",null,"Blackburn Rovers"]

{"sheet":"Calculations","index":4,"n_rows":31,"n_cols":24,"rows_kept":31,"cut":false,"hidden":true,"merged":[[0,4,0,10],[0,11,0,17]]}
[null,null,null,null,"Home",null,null,null,null,null,null,"Away"]
["Rank Ties","Rank","Team","P","W","L","D","F","A","GD","Pts","W","L","D","F","A","GD","Pts","GD","Goals","Pts","Rank","GD Rank","Goals Rank"]
[{"$f":"IF(Teams!A2=\"\",\"\",RANK($B3,$B$3:$B$20,1)+COUNTIF($B$3:$B3,$B3)-1)","v":1},{"$f":"IF(Teams!A2=\"\",\"\",V3+W3+X3)","v":1},{"$f":"IF(Teams!A2=\"\",\"\",Teams!A2)","v":"Arsenal"},{"$f":"IF(Teams!A2=\"\",\"\",COUNTIFS(Fixtures!$A:$A,Calculations!$C3,Fixtures!$B:$B,\">=0\")+COUNTIFS(Fixtures!$E:$E,Calculations!$C3,Fixtures!$D:$D,\">=0\"))","v":0},{"$f":"IF(Teams!A2=\"\",\"\",SUMPRODUCT((Fixtures!$A:$A=Calculations!$C3)*(Fixtures!$B:$B>Fixtures!$D:$D)))","v":0},{"$f":"IF(Teams!A2=\"\",\"\",SUMPRODUCT((Fixtures!$A:$A=Calculations!$C3)*(Fixtures!$B:$B<Fixtures!$D:$D)))","v":0},{"$f":"IF(Teams!A2=\"\",\"\",SUMPRODUCT((Fixtures!$A:$A=Calculations!$C3)*(Fixtures!$B:$B=Fixtures!$D:$D)*(Fixtures!$B:$B<>\"\")))","v":0},{"$f":"IF(Teams!A2=\"\",\"\",SUMIFS(Fixtures!$B:$B,Fixtures!$A:$A,Calculations!$C3,Fixtures!$B:$B,\">=0\"))","v":0},{"$f":"IF(Teams!A2=\"\",\"\",SUMIFS(Fixtures!$D:$D,Fixtures!$A:$A,Calculations!$C3,Fixtures!$D:$D,\">=0\"))","v":0},{"$f":"IF(Teams!A2=\"\",\"\",H3-I3)","v":0},{"$f":"IF(Teams!A2=\"\",\"\",$E3*Data!$B$2+$G3*Data!$B$3)","v":0},{"$f":"IF(Teams!A2=\"\",\"\",SUMPRODUCT((Fixtures!$E:$E=Calculations!$C3)*(Fixtures!$D:$D>Fixtures!$B:$B)))","v":0},{"$f":"IF(Teams!A2=\"\",\"\",SUMPRODUCT((Fixtures!$E:$E=Calculations!$C3)*(Fixtures!$D:$D<Fixtures!$B:$B)))","v":0},{"$f":"IF(Teams!A2=\"\",\"\",SUMPRODUCT((Fixtures!$E:$E=Calculations!$C3)*(Fixtures!$D:$D=Fixtures!$B:$B)*(Fixtures!$D:$D<>\"\")))","v":0},{"$f":"IF(Teams!A2=\"\",\"\",SUMIFS(Fixtures!$D:$D,Fixtures!$E:$E,Calculations!$C3,Fixtures!$D:$D,\">=0\"))","v":0},{"$f":"IF(Teams!A2=\"\",\"\",SUMIFS(Fixtures!$B:$B,Fixtures!$E:$E,Calculations!$C3,Fixtures!$B:$B,\">=0\"))","v":0},{"$f":"IF(Teams!A2=\"\",\"\",O3-P3)","v":0},{"$f":"IF(Teams!A2=\"\",\"\",$L3*Data!$B$2+$N3*Data!$B$3)","v":0},{"$f":"IF(Teams!A2=\"\",\"\",J3+Q3)","v":0},{"$f":"IF(Teams!A2=\"\",\"\",H3+O3)","v":0},{"$f":"IF(Teams!A2=\"\",\"\",K3+R3)","v":0},{"$f":"IF(Teams!A2=\"\",\"\",RANK(U3,$U$3:$U$22))","v":1},{"$f":"IF(Teams!A2=\"\",\"\",SUMPRODUCT(($U$3:$U$22=U3)*($S$3:$S$22>S3)))","v":0},{"$f":"IF(Teams!A2=\"\",\"\",SUMPRODUCT(($U$3:$U$22=U3)*($S$3:$S$22=S3)*($T$3:$T$22>T3)))","v":0}]
[{"$f":"IF(Teams!A3=\"\",\"\",RANK($B4,$B$3:$B$20,1)+COUNTIF($B$3:$B4,$B4)-1)","v":2},{"$f":"IF(Teams!A3=\"\",\"\",V4+W4+X4)","v":1},{"$f":"IF(Teams!A3=\"\",\"\",Teams!A3)","v":"Aston Villa"},{"$f":"IF(Teams!A3=\"\",\"\",COUNTIFS(Fixtures!$A:$A,Calculations!$C4,Fixtures!$B:$B,\">=0\")+COUNTIFS(Fixtures!$E:$E,Calculations!$C4,Fixtures!$D:$D,\">=0\"))","v":0},{"$f":"IF(Teams!A3=\"\",\"\",SUMPRODUCT((Fixtures!$A:$A=Calculations!$C4)*(Fixtures!$B:$B>Fixtures!$D:$D)))","v":0},{"$f":"IF(Teams!A3=\"\",\"\",SUMPRODUCT((Fixtures!$A:$A=Calculations!$C4)*(Fixtures!$B:$B<Fixtures!$D:$D)))","v":0},{"$f":"IF(Teams!A3=\"\",\"\",SUMPRODUCT((Fixtures!$A:$A=Calculations!$C4)*(Fixtures!$B:$B=Fixtures!$D:$D)*(Fixtures!$B:$B<>\"\")))","v":0},{"$f":"IF(Teams!A3=\"\",\"\",SUMIFS(Fixtures!$B:$B,Fixtures!$A:$A,Calculations!$C4,Fixtures!$B:$B,\">=0\"))","v":0},{"$f":"IF(Teams!A3=\"\",\"\",SUMIFS(Fixtures!$D:$D,Fixtures!$A:$A,Calculations!$C4,Fixtures!$D:$D,\">=0\"))","v":0},{"$f":"IF(Teams!A3=\"\",\"\",H4-I4)","v":0},{"$f":"IF(Teams!A3=\"\",\"\",$E4*Data!$B$2+$G4*Data!$B$3)","v":0},{"$f":"IF(Teams!A3=\"\",\"\",SUMPRODUCT((Fixtures!$E:$E=Calculations!$C4)*(Fixtures!$D:$D>Fixtures!$B:$B)))","v":0},{"$f":"IF(Teams!A3=\"\",\"\",SUMPRODUCT((Fixtures!$E:$E=Calculations!$C4)*(Fixtures!$D:$D<Fixtures!$B:$B)))","v":0},{"$f":"IF(Teams!A3=\"\",\"\",SUMPRODUCT((Fixtures!$E:$E=Calculations!$C4)*(Fixtures!$D:$D=Fixtures!$B:$B)*(Fixtures!$D:$D<>\"\")))","v":0},{"$f":"IF(Teams!A3=\"\",\"\",SUMIFS(Fixtures!$D:$D,Fixtures!$E:$E,Calculations!$C4,Fixtures!$D:$D,\">=0\"))","v":0},{"$f":"IF(Teams!A3=\"\",\"\",SUMIFS(Fixtures!$B:$B,Fixtures!$E:$E,Calculations!$C4,Fixtures!$B:$B,\">=0\"))","v":0},{"$f":"IF(Teams!A3=\"\",\"\",O4-P4)","v":0},{"$f":"IF(Teams!A3=\"\",\"\",$L4*Data!$B$2+$N4*Data!$B$3)","v":0},{"$f":"IF(Teams!A3=\"\",\"\",J4+Q4)","v":0},{"$f":"IF(Teams!A3=\"\",\"\",H4+O4)","v":0},{"$f":"IF(Teams!A3=\"\",\"\",K4+R4)","v":0},{"$f":"IF(Teams!A3=\"\",\"\",RANK(U4,$U$3:$U$22))","v":1},{"$f":"IF(Teams!A3=\"\",\"\",SUMPRODUCT(($U$3:$U$22=U4)*($S$3:$S$22>S4)))","v":0},{"$f":"IF(Teams!A3=\"\",\"\",SUMPRODUCT(($U$3:$U$22=U4)*($S$3:$S$22=S4)*($T$3:$T$22>T4)))","v":0}]
[{"$f":"IF(Teams!A4=\"\",\"\",RANK($B5,$B$3:$B$20,1)+COUNTIF($B$3:$B5,$B5)-1)","v":3},{"$f":"IF(Teams!A4=\"\",\"\",V5+W5+X5)","v":1},{"$f":"IF(Teams!A4=\"\",\"\",Teams!A4)","v":"Blackburn Rovers"},{"$f":"IF(Teams!A4=\"\",\"\",COUNTIFS(Fixtures!$A:$A,Calculations!$C5,Fixtures!$B:$B,\">=0\")+COUNTIFS(Fixtures!$E:$E,Calculations!$C5,Fixtures!$D:$D,\">=0\"))","v":0},{"$f":"IF(Teams!A4=\"\",\"\",SUMPRODUCT((Fixtures!$A:$A=Calculations!$C5)*(Fixtures!$B:$B>Fixtures!$D:$D)))","v":0},{"$f":"IF(Teams!A4=\"\",\"\",SUMPRODUCT((Fixtures!$A:$A=Calculations!$C5)*(Fixtures!$B:$B<Fixtures!$D:$D)))","v":0},{"$f":"IF(Teams!A4=\"\",\"\",SUMPRODUCT((Fixtures!$A:$A=Calculations!$C5)*(Fixtures!$B:$B=Fixtures!$D:$D)*(Fixtures!$B:$B<>\"\")))","v":0},{"$f":"IF(Teams!A4=\"\",\"\",SUMIFS(Fixtures!$B:$B,Fixtures!$A:$A,Calculations!$C5,Fixtures!$B:$B,\">=0\"))","v":0},{"$f":"IF(Teams!A4=\"\",\"\",SUMIFS(Fixtures!$D:$D,Fixtures!$A:$A,Calculations!$C5,Fixtures!$D:$D,\">=0\"))","v":0},{"$f":"IF(Teams!A4=\"\",\"\",H5-I5)","v":0},{"$f":"IF(Teams!A4=\"\",\"\",$E5*Data!$B$2+$G5*Data!$B$3)","v":0},{"$f":"IF(Teams!A4=\"\",\"\",SUMPRODUCT((Fixtures!$E:$E=Calculations!$C5)*(Fixtures!$D:$D>Fixtures!$B:$B)))","v":0},{"$f":"IF(Teams!A4=\"\",\"\",SUMPRODUCT((Fixtures!$E:$E=Calculations!$C5)*(Fixtures!$D:$D<Fixtures!$B:$B)))","v":0},{"$f":"IF(Teams!A4=\"\",\"\",SUMPRODUCT((Fixtures!$E:$E=Calculations!$C5)*(Fixtures!$D:$D=Fixtures!$B:$B)*(Fixtures!$D:$D<>\"\")))","v":0},{"$f":"IF(Teams!A4=\"\",\"\",SUMIFS(Fixtures!$D:$D,Fixtures!$E:$E,Calculations!$C5,Fixtures!$D:$D,\">=0\"))","v":0},{"$f":"IF(Teams!A4=\"\",\"\",SUMIFS(Fixtures!$B:$B,Fixtures!$E:$E,Calculations!$C5,Fixtures!$B:$B,\">=0\"))","v":0},{"$f":"IF(Teams!A4=\"\",\"\",O5-P5)","v":0},{"$f":"IF(Teams!A4=\"\",\"\",$L5*Data!$B$2+$N5*Data!$B$3)","v":0},{"$f":"IF(Teams!A4=\"\",\"\",J5+Q5)","v":0},{"$f":"IF(Teams!A4=\"\",\"\",H5+O5)","v":0},{"$f":"IF(Teams!A4=\"\",\"\",K5+R5)","v":0},{"$f":"IF(Teams!A4=\"\",\"\",RANK(U5,$U$3:$U$22))","v":1},{"$f":"IF(Teams!A4=\"\",\"\",SUMPRODUCT(($U$3:$U$22=U5)*($S$3:$S$22>S5)))","v":0},{"$f":"IF(Teams!A4=\"\",\"\",SUMPRODUCT(($U$3:$U$22=U5)*($S$3:$S$22=S5)*($T$3:$T$22>T5)))","v":0}]
[{"$f":"IF(Teams!A5=\"\",\"\",RANK($B6,$B$3:$B$20,1)+COUNTIF($B$3:$B6,$B6)-1)","v":4},{"$f":"IF(Teams!A5=\"\",\"\",V6+W6+X6)","v":1},{"$f":"IF(Teams!A5=\"\",\"\",Teams!A5)","v":"Bolton Wanderers"},{"$f":"IF(Teams!A5=\"\",\"\",COUNTIFS(Fixtures!$A:$A,Calculations!$C6,Fixtures!$B:$B,\">=0\")+COUNTIFS(Fixtures!$E:$E,Calculations!$C6,Fixtures!$D:$D,\">=0\"))","v":0},{"$f":"IF(Teams!A5=\"\",\"\",SUMPRODUCT((Fixtures!$A:$A=Calculations!$C6)*(Fixtures!$B:$B>Fixtures!$D:$D)))","v":0},{"$f":"IF(Teams!A5=\"\",\"\",SUMPRODUCT((Fixtures!$A:$A=Calculations!$C6)*(Fixtures!$B:$B<Fixtures!$D:$D)))","v":0},{"$f":"IF(Teams!A5=\"\",\"\",SUMPRODUCT((Fixtures!$A:$A=Calculations!$C6)*(Fixtures!$B:$B=Fixtures!$D:$D)*(Fixtures!$B:$B<>\"\")))","v":0},{"$f":"IF(Teams!A5=\"\",\"\",SUMIFS(Fixtures!$B:$B,Fixtures!$A:$A,Calculations!$C6,Fixtures!$B:$B,\">=0\"))","v":0},{"$f":"IF(Teams!A5=\"\",\"\",SUMIFS(Fixtures!$D:$D,Fixtures!$A:$A,Calculations!$C6,Fixtures!$D:$D,\">=0\"))","v":0},{"$f":"IF(Teams!A5=\"\",\"\",H6-I6)","v":0},{"$f":"IF(Teams!A5=\"\",\"\",$E6*Data!$B$2+$G6*Data!$B$3)","v":0},{"$f":"IF(Teams!A5=\"\",\"\",SUMPRODUCT((Fixtures!$E:$E=Calculations!$C6)*(Fixtures!$D:$D>Fixtures!$B:$B)))","v":0},{"$f":"IF(Teams!A5=\"\",\"\",SUMPRODUCT((Fixtures!$E:$E=Calculations!$C6)*(Fixtures!$D:$D<Fixtures!$B:$B)))","v":0},{"$f":"IF(Teams!A5=\"\",\"\",SUMPRODUCT((Fixtures!$E:$E=Calculations!$C6)*(Fixtures!$D:$D=Fixtures!$B:$B)*(Fixtures!$D:$D<>\"\")))","v":0},{"$f":"IF(Teams!A5=\"\",\"\",SUMIFS(Fixtures!$D:$D,Fixtures!$E:$E,Calculations!$C6,Fixtures!$D:$D,\">=0\"))","v":0},{"$f":"IF(Teams!A5=\"\",\"\",SUMIFS(Fixtures!$B:$B,Fixtures!$E:$E,Calculations!$C6,Fixtures!$B:$B,\">=0\"))","v":0},{"$f":"IF(Teams!A5=\"\",\"\",O6-P6)","v":0},{"$f":"IF(Teams!A5=\"\",\"\",$L6*Data!$B$2+$N6*Data!$B$3)","v":0},{"$f":"IF(Teams!A5=\"\",\"\",J6+Q6)","v":0},{"$f":"IF(Teams!A5=\"\",\"\",H6+O6)","v":0},{"$f":"IF(Teams!A5=\"\",\"\",K6+R6)","v":0},{"$f":"IF(Teams!A5=\"\",\"\",RANK(U6,$U$3:$U$22))","v":1},{"$f":"IF(Teams!A5=\"\",\"\",SUMPRODUCT(($U$3:$U$22=U6)*($S$3:$S$22>S6)))","v":0},{"$f":"IF(Teams!A5=\"\",\"\",SUMPRODUCT(($U$3:$U$22=U6)*($S$3:$S$22=S6)*($T$3:$T$22>T6)))","v":0}]
[{"$f":"IF(Teams!A6=\"\",\"\",RANK($B7,$B$3:$B$20,1)+COUNTIF($B$3:$B7,$B7)-1)","v":5},{"$f":"IF(Teams!A6=\"\",\"\",V7+W7+X7)","v":1},{"$f":"IF(Teams!A6=\"\",\"\",Teams!A6)","v":"Chelsea"},{"$f":"IF(Teams!A6=\"\",\"\",COUNTIFS(Fixtures!$A:$A,Calculations!$C7,Fixtures!$B:$B,\">=0\")+COUNTIFS(Fixtures!$E:$E,Calculations!$C7,Fixtures!$D:$D,\">=0\"))","v":0},{"$f":"IF(Teams!A6=\"\",\"\",SUMPRODUCT((Fixtures!$A:$A=Calculations!$C7)*(Fixtures!$B:$B>Fixtures!$D:$D)))","v":0},{"$f":"IF(Teams!A6=\"\",\"\",SUMPRODUCT((Fixtures!$A:$A=Calculations!$C7)*(Fixtures!$B:$B<Fixtures!$D:$D)))","v":0},{"$f":"IF(Teams!A6=\"\",\"\",SUMPRODUCT((Fixtures!$A:$A=Calculations!$C7)*(Fixtures!$B:$B=Fixtures!$D:$D)*(Fixtures!$B:$B<>\"\")))","v":0},{"$f":"IF(Teams!A6=\"\",\"\",SUMIFS(Fixtures!$B:$B,Fixtures!$A:$A,Calculations!$C7,Fixtures!$B:$B,\">=0\"))","v":0},{"$f":"IF(Teams!A6=\"\",\"\",SUMIFS(Fixtures!$D:$D,Fixtures!$A:$A,Calculations!$C7,Fixtures!$D:$D,\">=0\"))","v":0},{"$f":"IF(Teams!A6=\"\",\"\",H7-I7)","v":0},{"$f":"IF(Teams!A6=\"\",\"\",$E7*Data!$B$2+$G7*Data!$B$3)","v":0},{"$f":"IF(Teams!A6=\"\",\"\",SUMPRODUCT((Fixtures!$E:$E=Calculations!$C7)*(Fixtures!$D:$D>Fixtures!$B:$B)))","v":0},{"$f":"IF(Teams!A6=\"\",\"\",SUMPRODUCT((Fixtures!$E:$E=Calculations!$C7)*(Fixtures!$D:$D<Fixtures!$B:$B)))","v":0},{"$f":"IF(Teams!A6=\"\",\"\",SUMPRODUCT((Fixtures!$E:$E=Calculations!$C7)*(Fixtures!$D:$D=Fixtures!$B:$B)*(Fixtures!$D:$D<>\"\")))","v":0},{"$f":"IF(Teams!A6=\"\",\"\",SUMIFS(Fixtures!$D:$D,Fixtures!$E:$E,Calculations!$C7,Fixtures!$D:$D,\">=0\"))","v":0},{"$f":"IF(Teams!A6=\"\",\"\",SUMIFS(Fixtures!$B:$B,Fixtures!$E:$E,Calculations!$C7,Fixtures!$B:$B,\">=0\"))","v":0},{"$f":"IF(Teams!A6=\"\",\"\",O7-P7)","v":0},{"$f":"IF(Teams!A6=\"\",\"\",$L7*Data!$B$2+$N7*Data!$B$3)","v":0},{"$f":"IF(Teams!A6=\"\",\"\",J7+Q7)","v":0},{"$f":"IF(Teams!A6=\"\",\"\",H7+O7)","v":0},{"$f":"IF(Teams!A6=\"\",\"\",K7+R7)","v":0},{"$f":"IF(Teams!A6=\"\",\"\",RANK(U7,$U$3:$U$22))","v":1},{"$f":"IF(Teams!A6=\"\",\"\",SUMPRODUCT(($U$3:$U$22=U7)*($S$3:$S$22>S7)))","v":0},{"$f":"IF(Teams!A6=\"\",\"\",SUMPRODUCT(($U$3:$U$22=U7)*($S$3:$S$22=S7)*($T$3:$T$22>T7)))","v":0}]
[{"$f":"IF(Teams!A7=\"\",\"\",RANK($B8,$B$3:$B$20,1)+COUNTIF($B$3:$B8,$B8)-1)","v":6},{"$f":"IF(Teams!A7=\"\",\"\",V8+W8+X8)","v":1},{"$f":"IF(Teams!A7=\"\",\"\",Teams!A7)","v":"Everton"},{"$f":"IF(Teams!A7=\"\",\"\",COUNTIFS(Fixtures!$A:$A,Calculations!$C8,Fixtures!$B:$B,\">=0\")+COUNTIFS(Fixtures!$E:$E,Calculations!$C8,Fixtures!$D:$D,\">=0\"))","v":0},{"$f":"IF(Teams!A7=\"\",\"\",SUMPRODUCT((Fixtures!$A:$A=Calculations!$C8)*(Fixtures!$B:$B>Fixtures!$D:$D)))","v":0},{"$f":"IF(Teams!A7=\"\",\"\",SUMPRODUCT((Fixtures!$A:$A=Calculations!$C8)*(Fixtures!$B:$B<Fixtures!$D:$D)))","v":0},{"$f":"IF(Teams!A7=\"\",\"\",SUMPRODUCT((Fixtures!$A:$A=Calculations!$C8)*(Fixtures!$B:$B=Fixtures!$D:$D)*(Fixtures!$B:$B<>\"\")))","v":0},{"$f":"IF(Teams!A7=\"\",\"\",SUMIFS(Fixtures!$B:$B,Fixtures!$A:$A,Calculations!$C8,Fixtures!$B:$B,\">=0\"))","v":0},{"$f":"IF(Teams!A7=\"\",\"\",SUMIFS(Fixtures!$D:$D,Fixtures!$A:$A,Calculations!$C8,Fixtures!$D:$D,\">=0\"))","v":0},{"$f":"IF(Teams!A7=\"\",\"\",H8-I8)","v":0},{"$f":"IF(Teams!A7=\"\",\"\",$E8*Data!$B$2+$G8*Data!$B$3)","v":0},{"$f":"IF(Teams!A7=\"\",\"\",SUMPRODUCT((Fixtures!$E:$E=Calculations!$C8)*(Fixtures!$D:$D>Fixtures!$B:$B)))","v":0},{"$f":"IF(Teams!A7=\"\",\"\",SUMPRODUCT((Fixtures!$E:$E=Calculations!$C8)*(Fixtures!$D:$D<Fixtures!$B:$B)))","v":0},{"$f":"IF(Teams!A7=\"\",\"\",SUMPRODUCT((Fixtures!$E:$E=Calculations!$C8)*(Fixtures!$D:$D=Fixtures!$B:$B)*(Fixtures!$D:$D<>\"\")))","v":0},{"$f":"IF(Teams!A7=\"\",\"\",SUMIFS(Fixtures!$D:$D,Fixtures!$E:$E,Calculations!$C8,Fixtures!$D:$D,\">=0\"))","v":0},{"$f":"IF(Teams!A7=\"\",\"\",SUMIFS(Fixtures!$B:$B,Fixtures!$E:$E,Calculations!$C8,Fixtures!$B:$B,\">=0\"))","v":0},{"$f":"IF(Teams!A7=\"\",\"\",O8-P8)","v":0},{"$f":"IF(Teams!A7=\"\",\"\",$L8*Data!$B$2+$N8*Data!$B$3)","v":0},{"$f":"IF(Teams!A7=\"\",\"\",J8+Q8)","v":0},{"$f":"IF(Teams!A7=\"\",\"\",H8+O8)","v":0},{"$f":"IF(Teams!A7=\"\",\"\",K8+R8)","v":0},{"$f":"IF(Teams!A7=\"\",\"\",RANK(U8,$U$3:$U$22))","v":1},{"$f":"IF(Teams!A7=\"\",\"\",SUMPRODUCT(($U$3:$U$22=U8)*($S$3:$S$22>S8)))","v":0},{"$f":"IF(Teams!A7=\"\",\"\",SUMPRODUCT(($U$3:$U$22=U8)*($S$3:$S$22=S8)*($T$3:$T$22>T8)))","v":0}]
[{"$f":"IF(Teams!A8=\"\",\"\",RANK($B9,$B$3:$B$20,1)+COUNTIF($B$3:$B9,$B9)-1)","v":7},{"$f":"IF(Teams!A8=\"\",\"\",V9+W9+X9)","v":1},{"$f":"IF(Teams!A8=\"\",\"\",Teams!A8)","v":"Fulham"},{"$f":"IF(Teams!A8=\"\",\"\",COUNTIFS(Fixtures!$A:$A,Calculations!$C9,Fixtures!$B:$B,\">=0\")+COUNTIFS(Fixtures!$E:$E,Calculations!$C9,Fixtures!$D:$D,\">=0\"))","v":0},{"$f":"IF(Teams!A8=\"\",\"\",SUMPRODUCT((Fixtures!$A:$A=Calculations!$C9)*(Fixtures!$B:$B>Fixtures!$D:$D)))","v":0},{"$f":"IF(Teams!A8=\"\",\"\",SUMPRODUCT((Fixtures!$A:$A=Calculations!$C9)*(Fixtures!$B:$B<Fixtures!$D:$D)))","v":0},{"$f":"IF(Teams!A8=\"\",\"\",SUMPRODUCT((Fixtures!$A:$A=Calculations!$C9)*(Fixtures!$B:$B=Fixtures!$D:$D)*(Fixtures!$B:$B<>\"\")))","v":0},{"$f":"IF(Teams!A8=\"\",\"\",SUMIFS(Fixtures!$B:$B,Fixtures!$A:$A,Calculations!$C9,Fixtures!$B:$B,\">=0\"))","v":0},{"$f":"IF(Teams!A8=\"\",\"\",SUMIFS(Fixtures!$D:$D,Fixtures!$A:$A,Calculations!$C9,Fixtures!$D:$D,\">=0\"))","v":0},{"$f":"IF(Teams!A8=\"\",\"\",H9-I9)","v":0},{"$f":"IF(Teams!A8=\"\",\"\",$E9*Data!$B$2+$G9*Data!$B$3)","v":0},{"$f":"IF(Teams!A8=\"\",\"\",SUMPRODUCT((Fixtures!$E:$E=Calculations!$C9)*(Fixtures!$D:$D>Fixtures!$B:$B)))","v":0},{"$f":"IF(Teams!A8=\"\",\"\",SUMPRODUCT((Fixtures!$E:$E=Calculations!$C9)*(Fixtures!$D:$D<Fixtures!$B:$B)))","v":0},{"$f":"IF(Teams!A8=\"\",\"\",SUMPRODUCT((Fixtures!$E:$E=Calculations!$C9)*(Fixtures!$D:$D=Fixtures!$B:$B)*(Fixtures!$D:$D<>\"\")))","v":0},{"$f":"IF(Teams!A8=\"\",\"\",SUMIFS(Fixtures!$D:$D,Fixtures!$E:$E,Calculations!$C9,Fixtures!$D:$D,\">=0\"))","v":0},{"$f":"IF(Teams!A8=\"\",\"\",SUMIFS(Fixtures!$B:$B,Fixtures!$E:$E,Calculations!$C9,Fixtures!$B:$B,\">=0\"))","v":0},{"$f":"IF(Teams!A8=\"\",\"\",O9-P9)","v":0},{"$f":"IF(Teams!A8=\"\",\"\",$L9*Data!$B$2+$N9*Data!$B$3)","v":0},{"$f":"IF(Teams!A8=\"\",\"\",J9+Q9)","v":0},{"$f":"IF(Teams!A8=\"\",\"\",H9+O9)","v":0},{"$f":"IF(Teams!A8=\"\",\"\",K9+R9)","v":0},{"$f":"IF(Teams!A8=\"\",\"\",RANK(U9,$U$3:$U$22))","v":1},{"$f":"IF(Teams!A8=\"\",\"\",SUMPRODUCT(($U$3:$U$22=U9)*($S$3:$S$22>S9)))","v":0},{"$f":"IF(Teams!A8=\"\",\"\",SUMPRODUCT(($U$3:$U$22=U9)*($S$3:$S$22=S9)*($T$3:$T$22>T9)))","v":0}]
[{"$f":"IF(Teams!A9=\"\",\"\",RANK($B10,$B$3:$B$20,1)+COUNTIF($B$3:$B10,$B10)-1)","v":8},{"$f":"IF(Teams!A9=\"\",\"\",V10+W10+X10)","v":1},{"$f":"IF(Teams!A9=\"\",\"\",Teams!A9)","v":"Liverpool"},{"$f":"IF(Teams!A9=\"\",\"\",COUNTIFS(Fixtures!$A:$A,Calculations!$C10,Fixtures!$B:$B,\">=0\")+COUNTIFS(Fixtures!$E:$E,Calculations!$C10,Fixtures!$D:$D,\">=0\"))","v":0},{"$f":"IF(Teams!A9=\"\",\"\",SUMPRODUCT((Fixtures!$A:$A=Calculations!$C10)*(Fixtures!$B:$B>Fixtures!$D:$D)))","v":0},{"$f":"IF(Teams!A9=\"\",\"\",SUMPRODUCT((Fixtures!$A:$A=Calculations!$C10)*(Fixtures!$B:$B<Fixtures!$D:$D)))","v":0},{"$f":"IF(Teams!A9=\"\",\"\",SUMPRODUCT((Fixtures!$A:$A=Calculations!$C10)*(Fixtures!$B:$B=Fixtures!$D:$D)*(Fixtures!$B:$B<>\"\")))","v":0},{"$f":"IF(Teams!A9=\"\",\"\",SUMIFS(Fixtures!$B:$B,Fixtures!$A:$A,Calculations!$C10,Fixtures!$B:$B,\">=0\"))","v":0},{"$f":"IF(Teams!A9=\"\",\"\",SUMIFS(Fixtures!$D:$D,Fixtures!$A:$A,Calculations!$C10,Fixtures!$D:$D,\">=0\"))","v":0},{"$f":"IF(Teams!A9=\"\",\"\",H10-I10)","v":0},{"$f":"IF(Teams!A9=\"\",\"\",$E10*Data!$B$2+$G10*Data!$B$3)","v":0},{"$f":"IF(Teams!A9=\"\",\"\",SUMPRODUCT((Fixtures!$E:$E=Calculations!$C10)*(Fixtures!$D:$D>Fixtures!$B:$B)))","v":0},{"$f":"IF(Teams!A9=\"\",\"\",SUMPRODUCT((Fixtures!$E:$E=Calculations!$C10)*(Fixtures!$D:$D<Fixtures!$B:$B)))","v":0},{"$f":"IF(Teams!A9=\"\",\"\",SUMPRODUCT((Fixtures!$E:$E=Calculations!$C10)*(Fixtures!$D:$D=Fixtures!$B:$B)*(Fixtures!$D:$D<>\"\")))","v":0},{"$f":"IF(Teams!A9=\"\",\"\",SUMIFS(Fixtures!$D:$D,Fixtures!$E:$E,Calculations!$C10,Fixtures!$D:$D,\">=0\"))","v":0},{"$f":"IF(Teams!A9=\"\",\"\",SUMIFS(Fixtures!$B:$B,Fixtures!$E:$E,Calculations!$C10,Fixtures!$B:$B,\">=0\"))","v":0},{"$f":"IF(Teams!A9=\"\",\"\",O10-P10)","v":0},{"$f":"IF(Teams!A9=\"\",\"\",$L10*Data!$B$2+$N10*Data!$B$3)","v":0},{"$f":"IF(Teams!A9=\"\",\"\",J10+Q10)","v":0},{"$f":"IF(Teams!A9=\"\",\"\",H10+O10)","v":0},{"$f":"IF(Teams!A9=\"\",\"\",K10+R10)","v":0},{"$f":"IF(Teams!A9=\"\",\"\",RANK(U10,$U$3:$U$22))","v":1},{"$f":"IF(Teams!A9=\"\",\"\",SUMPRODUCT(($U$3:$U$22=U10)*($S$3:$S$22>S10)))","v":0},{"$f":"IF(Teams!A9=\"\",\"\",SUMPRODUCT(($U$3:$U$22=U10)*($S$3:$S$22=S10)*($T$3:$T$22>T10)))","v":0}]
[{"$f":"IF(Teams!A10=\"\",\"\",RANK($B11,$B$3:$B$20,1)+COUNTIF($B$3:$B11,$B11)-1)","v":9},{"$f":"IF(Teams!A10=\"\",\"\",V11+W11+X11)","v":1},{"$f":"IF(Teams!A10=\"\",\"\",Teams!A10)","v":"Manchester City"},{"$f":"IF(Teams!A10=\"\",\"\",COUNTIFS(Fixtures!$A:$A,Calculations!$C11,Fixtures!$B:$B,\">=0\")+COUNTIFS(Fixtures!$E:$E,Calculations!$C11,Fixtures!$D:$D,\">=0\"))","v":0},{"$f":"IF(Teams!A10=\"\",\"\",SUMPRODUCT((Fixtures!$A:$A=Calculations!$C11)*(Fixtures!$B:$B>Fixtures!$D:$D)))","v":0},{"$f":"IF(Teams!A10=\"\",\"\",SUMPRODUCT((Fixtures!$A:$A=Calculations!$C11)*(Fixtures!$B:$B<Fixtures!$D:$D)))","v":0},{"$f":"IF(Teams!A10=\"\",\"\",SUMPRODUCT((Fixtures!$A:$A=Calculations!$C11)*(Fixtures!$B:$B=Fixtures!$D:$D)*(Fixtures!$B:$B<>\"\")))","v":0},{"$f":"IF(Teams!A10=\"\",\"\",SUMIFS(Fixtures!$B:$B,Fixtures!$A:$A,Calculations!$C11,Fixtures!$B:$B,\">=0\"))","v":0},{"$f":"IF(Teams!A10=\"\",\"\",SUMIFS(Fixtures!$D:$D,Fixtures!$A:$A,Calculations!$C11,Fixtures!$D:$D,\">=0\"))","v":0},{"$f":"IF(Teams!A10=\"\",\"\",H11-I11)","v":0},{"$f":"IF(Teams!A10=\"\",\"\",$E11*Data!$B$2+$G11*Data!$B$3)","v":0},{"$f":"IF(Teams!A10=\"\",\"\",SUMPRODUCT((Fixtures!$E:$E=Calculations!$C11)*(Fixtures!$D:$D>Fixtures!$B:$B)))","v":0},{"$f":"IF(Teams!A10=\"\",\"\",SUMPRODUCT((Fixtures!$E:$E=Calculations!$C11)*(Fixtures!$D:$D<Fixtures!$B:$B)))","v":0},{"$f":"IF(Teams!A10=\"\",\"\",SUMPRODUCT((Fixtures!$E:$E=Calculations!$C11)*(Fixtures!$D:$D=Fixtures!$B:$B)*(Fixtures!$D:$D<>\"\")))","v":0},{"$f":"IF(Teams!A10=\"\",\"\",SUMIFS(Fixtures!$D:$D,Fixtures!$E:$E,Calculations!$C11,Fixtures!$D:$D,\">=0\"))","v":0},{"$f":"IF(Teams!A10=\"\",\"\",SUMIFS(Fixtures!$B:$B,Fixtures!$E:$E,Calculations!$C11,Fixtures!$B:$B,\">=0\"))","v":0},{"$f":"IF(Teams!A10=\"\",\"\",O11-P11)","v":0},{"$f":"IF(Teams!A10=\"\",\"\",$L11*Data!$B$2+$N11*Data!$B$3)","v":0},{"$f":"IF(Teams!A10=\"\",\"\",J11+Q11)","v":0},{"$f":"IF(Teams!A10=\"\",\"\",H11+O11)","v":0},{"$f":"IF(Teams!A10=\"\",\"\",K11+R11)","v":0},{"$f":"IF(Teams!A10=\"\",\"\",RANK(U11,$U$3:$U$22))","v":1},{"$f":"IF(Teams!A10=\"\",\"\",SUMPRODUCT(($U$3:$U$22=U11)*($S$3:$S$22>S11)))","v":0},{"$f":"IF(Teams!A10=\"\",\"\",SUMPRODUCT(($U$3:$U$22=U11)*($S$3:$S$22=S11)*($T$3:$T$22>T11)))","v":0}]
[{"$f":"IF(Teams!A11=\"\",\"\",RANK($B12,$B$3:$B$20,1)+COUNTIF($B$3:$B12,$B12)-1)","v":10},{"$f":"IF(Teams!A11=\"\",\"\",V12+W12+X12)","v":1},{"$f":"IF(Teams!A11=\"\",\"\",Teams!A11)","v":"Manchester United"},{"$f":"IF(Teams!A11=\"\",\"\",COUNTIFS(Fixtures!$A:$A,Calculations!$C12,Fixtures!$B:$B,\">=0\")+COUNTIFS(Fixtures!$E:$E,Calculations!$C12,Fixtures!$D:$D,\">=0\"))","v":0},{"$f":"IF(Teams!A11=\"\",\"\",SUMPRODUCT((Fixtures!$A:$A=Calculations!$C12)*(Fixtures!$B:$B>Fixtures!$D:$D)))","v":0},{"$f":"IF(Teams!A11=\"\",\"\",SUMPRODUCT((Fixtures!$A:$A=Calculations!$C12)*(Fixtures!$B:$B<Fixtures!$D:$D)))","v":0},{"$f":"IF(Teams!A11=\"\",\"\",SUMPRODUCT((Fixtures!$A:$A=Calculations!$C12)*(Fixtures!$B:$B=Fixtures!$D:$D)*(Fixtures!$B:$B<>\"\")))","v":0},{"$f":"IF(Teams!A11=\"\",\"\",SUMIFS(Fixtures!$B:$B,Fixtures!$A:$A,Calculations!$C12,Fixtures!$B:$B,\">=0\"))","v":0},{"$f":"IF(Teams!A11=\"\",\"\",SUMIFS(Fixtures!$D:$D,Fixtures!$A:$A,Calculations!$C12,Fixtures!$D:$D,\">=0\"))","v":0},{"$f":"IF(Teams!A11=\"\",\"\",H12-I12)","v":0},{"$f":"IF(Teams!A11=\"\",\"\",$E12*Data!$B$2+$G12*Data!$B$3)","v":0},{"$f":"IF(Teams!A11=\"\",\"\",SUMPRODUCT((Fixtures!$E:$E=Calculations!$C12)*(Fixtures!$D:$D>Fixtures!$B:$B)))","v":0},{"$f":"IF(Teams!A11=\"\",\"\",SUMPRODUCT((Fixtures!$E:$E=Calculations!$C12)*(Fixtures!$D:$D<Fixtures!$B:$B)))","v":0},{"$f":"IF(Teams!A11=\"\",\"\",SUMPRODUCT((Fixtures!$E:$E=Calculations!$C12)*(Fixtures!$D:$D=Fixtures!$B:$B)*(Fixtures!$D:$D<>\"\")))","v":0},{"$f":"IF(Teams!A11=\"\",\"\",SUMIFS(Fixtures!$D:$D,Fixtures!$E:$E,Calculations!$C12,Fixtures!$D:$D,\">=0\"))","v":0},{"$f":"IF(Teams!A11=\"\",\"\",SUMIFS(Fixtures!$B:$B,Fixtures!$E:$E,Calculations!$C12,Fixtures!$B:$B,\">=0\"))","v":0},{"$f":"IF(Teams!A11=\"\",\"\",O12-P12)","v":0},{"$f":"IF(Teams!A11=\"\",\"\",$L12*Data!$B$2+$N12*Data!$B$3)","v":0},{"$f":"IF(Teams!A11=\"\",\"\",J12+Q12)","v":0},{"$f":"IF(Teams!A11=\"\",\"\",H12+O12)","v":0},{"$f":"IF(Teams!A11=\"\",\"\",K12+R12)","v":0},{"$f":"IF(Teams!A11=\"\",\"\",RANK(U12,$U$3:$U$22))","v":1},{"$f":"IF(Teams!A11=\"\",\"\",SUMPRODUCT(($U$3:$U$22=U12)*($S$3:$S$22>S12)))","v":0},{"$f":"IF(Teams!A11=\"\",\"\",SUMPRODUCT(($U$3:$U$22=U12)*($S$3:$S$22=S12)*($T$3:$T$22>T12)))","v":0}]
[{"$f":"IF(Teams!A12=\"\",\"\",RANK($B13,$B$3:$B$20,1)+COUNTIF($B$3:$B13,$B13)-1)","v":11},{"$f":"IF(Teams!A12=\"\",\"\",V13+W13+X13)","v":1},{"$f":"IF(Teams!A12=\"\",\"\",Teams!A12)","v":"Newcastle United"},{"$f":"IF(Teams!A12=\"\",\"\",COUNTIFS(Fixtures!$A:$A,Calculations!$C13,Fixtures!$B:$B,\">=0\")+COUNTIFS(Fixtures!$E:$E,Calculations!$C13,Fixtures!$D:$D,\">=0\"))","v":0},{"$f":"IF(Teams!A12=\"\",\"\",SUMPRODUCT((Fixtures!$A:$A=Calculations!$C13)*(Fixtures!$B:$B>Fixtures!$D:$D)))","v":0},{"$f":"IF(Teams!A12=\"\",\"\",SUMPRODUCT((Fixtures!$A:$A=Calculations!$C13)*(Fixtures!$B:$B<Fixtures!$D:$D)))","v":0},{"$f":"IF(Teams!A12=\"\",\"\",SUMPRODUCT((Fixtures!$A:$A=Calculations!$C13)*(Fixtures!$B:$B=Fixtures!$D:$D)*(Fixtures!$B:$B<>\"\")))","v":0},{"$f":"IF(Teams!A12=\"\",\"\",SUMIFS(Fixtures!$B:$B,Fixtures!$A:$A,Calculations!$C13,Fixtures!$B:$B,\">=0\"))","v":0},{"$f":"IF(Teams!A12=\"\",\"\",SUMIFS(Fixtures!$D:$D,Fixtures!$A:$A,Calculations!$C13,Fixtures!$D:$D,\">=0\"))","v":0},{"$f":"IF(Teams!A12=\"\",\"\",H13-I13)","v":0},{"$f":"IF(Teams!A12=\"\",\"\",$E13*Data!$B$2+$G13*Data!$B$3)","v":0},{"$f":"IF(Teams!A12=\"\",\"\",SUMPRODUCT((Fixtures!$E:$E=Calculations!$C13)*(Fixtures!$D:$D>Fixtures!$B:$B)))","v":0},{"$f":"IF(Teams!A12=\"\",\"\",SUMPRODUCT((Fixtures!$E:$E=Calculations!$C13)*(Fixtures!$D:$D<Fixtures!$B:$B)))","v":0},{"$f":"IF(Teams!A12=\"\",\"\",SUMPRODUCT((Fixtures!$E:$E=Calculations!$C13)*(Fixtures!$D:$D=Fixtures!$B:$B)*(Fixtures!$D:$D<>\"\")))","v":0},{"$f":"IF(Teams!A12=\"\",\"\",SUMIFS(Fixtures!$D:$D,Fixtures!$E:$E,Calculations!$C13,Fixtures!$D:$D,\">=0\"))","v":0},{"$f":"IF(Teams!A12=\"\",\"\",SUMIFS(Fixtures!$B:$B,Fixtures!$E:$E,Calculations!$C13,Fixtures!$B:$B,\">=0\"))","v":0},{"$f":"IF(Teams!A12=\"\",\"\",O13-P13)","v":0},{"$f":"IF(Teams!A12=\"\",\"\",$L13*Data!$B$2+$N13*Data!$B$3)","v":0},{"$f":"IF(Teams!A12=\"\",\"\",J13+Q13)","v":0},{"$f":"IF(Teams!A12=\"\",\"\",H13+O13)","v":0},{"$f":"IF(Teams!A12=\"\",\"\",K13+R13)","v":0},{"$f":"IF(Teams!A12=\"\",\"\",RANK(U13,$U$3:$U$22))","v":1},{"$f":"IF(Teams!A12=\"\",\"\",SUMPRODUCT(($U$3:$U$22=U13)*($S$3:$S$22>S13)))","v":0},{"$f":"IF(Teams!A12=\"\",\"\",SUMPRODUCT(($U$3:$U$22=U13)*($S$3:$S$22=S13)*($T$3:$T$22>T13)))","v":0}]
[{"$f":"IF(Teams!A13=\"\",\"\",RANK($B14,$B$3:$B$20,1)+COUNTIF($B$3:$B14,$B14)-1)","v":12},{"$f":"IF(Teams!A13=\"\",\"\",V14+W14+X14)","v":1},{"$f":"IF(Teams!A13=\"\",\"\",Teams!A13)","v":"Norwich"},{"$f":"IF(Teams!A13=\"\",\"\",COUNTIFS(Fixtures!$A:$A,Calculations!$C14,Fixtures!$B:$B,\">=0\")+COUNTIFS(Fixtures!$E:$E,Calculations!$C14,Fixtures!$D:$D,\">=0\"))","v":0},{"$f":"IF(Teams!A13=\"\",\"\",SUMPRODUCT((Fixtures!$A:$A=Calculations!$C14)*(Fixtures!$B:$B>Fixtures!$D:$D)))","v":0},{"$f":"IF(Teams!A13=\"\",\"\",SUMPRODUCT((Fixtures!$A:$A=Calculations!$C14)*(Fixtures!$B:$B<Fixtures!$D:$D)))","v":0},{"$f":"IF(Teams!A13=\"\",\"\",SUMPRODUCT((Fixtures!$A:$A=Calculations!$C14)*(Fixtures!$B:$B=Fixtures!$D:$D)*(Fixtures!$B:$B<>\"\")))","v":0},{"$f":"IF(Teams!A13=\"\",\"\",SUMIFS(Fixtures!$B:$B,Fixtures!$A:$A,Calculations!$C14,Fixtures!$B:$B,\">=0\"))","v":0},{"$f":"IF(Teams!A13=\"\",\"\",SUMIFS(Fixtures!$D:$D,Fixtures!$A:$A,Calculations!$C14,Fixtures!$D:$D,\">=0\"))","v":0},{"$f":"IF(Teams!A13=\"\",\"\",H14-I14)","v":0},{"$f":"IF(Teams!A13=\"\",\"\",$E14*Data!$B$2+$G14*Data!$B$3)","v":0},{"$f":"IF(Teams!A13=\"\",\"\",SUMPRODUCT((Fixtures!$E:$E=Calculations!$C14)*(Fixtures!$D:$D>Fixtures!$B:$B)))","v":0},{"$f":"IF(Teams!A13=\"\",\"\",SUMPRODUCT((Fixtures!$E:$E=Calculations!$C14)*(Fixtures!$D:$D<Fixtures!$B:$B)))","v":0},{"$f":"IF(Teams!A13=\"\",\"\",SUMPRODUCT((Fixtures!$E:$E=Calculations!$C14)*(Fixtures!$D:$D=Fixtures!$B:$B)*(Fixtures!$D:$D<>\"\")))","v":0},{"$f":"IF(Teams!A13=\"\",\"\",SUMIFS(Fixtures!$D:$D,Fixtures!$E:$E,Calculations!$C14,Fixtures!$D:$D,\">=0\"))","v":0},{"$f":"IF(Teams!A13=\"\",\"\",SUMIFS(Fixtures!$B:$B,Fixtures!$E:$E,Calculations!$C14,Fixtures!$B:$B,\">=0\"))","v":0},{"$f":"IF(Teams!A13=\"\",\"\",O14-P14)","v":0},{"$f":"IF(Teams!A13=\"\",\"\",$L14*Data!$B$2+$N14*Data!$B$3)","v":0},{"$f":"IF(Teams!A13=\"\",\"\",J14+Q14)","v":0},{"$f":"IF(Teams!A13=\"\",\"\",H14+O14)","v":0},{"$f":"IF(Teams!A13=\"\",\"\",K14+R14)","v":0},{"$f":"IF(Teams!A13=\"\",\"\",RANK(U14,$U$3:$U$22))","v":1},{"$f":"IF(Teams!A13=\"\",\"\",SUMPRODUCT(($U$3:$U$22=U14)*($S$3:$S$22>S14)))","v":0},{"$f":"IF(Teams!A13=\"\",\"\",SUMPRODUCT(($U$3:$U$22=U14)*($S$3:$S$22=S14)*($T$3:$T$22>T14)))","v":0}]
[{"$f":"IF(Teams!A14=\"\",\"\",RANK($B15,$B$3:$B$20,1)+COUNTIF($B$3:$B15,$B15)-1)","v":13},{"$f":"IF(Teams!A14=\"\",\"\",V15+W15+X15)","v":1},{"$f":"IF(Teams!A14=\"\",\"\",Teams!A14)","v":"Queens Park Rangers"},{"$f":"IF(Teams!A14=\"\",\"\",COUNTIFS(Fixtures!$A:$A,Calculations!$C15,Fixtures!$B:$B,\">=0\")+COUNTIFS(Fixtures!$E:$E,Calculations!$C15,Fixtures!$D:$D,\">=0\"))","v":0},{"$f":"IF(Teams!A14=\"\",\"\",SUMPRODUCT((Fixtures!$A:$A=Calculations!$C15)*(Fixtures!$B:$B>Fixtures!$D:$D)))","v":0},{"$f":"IF(Teams!A14=\"\",\"\",SUMPRODUCT((Fixtures!$A:$A=Calculations!$C15)*(Fixtures!$B:$B<Fixtures!$D:$D)))","v":0},{"$f":"IF(Teams!A14=\"\",\"\",SUMPRODUCT((Fixtures!$A:$A=Calculations!$C15)*(Fixtures!$B:$B=Fixtures!$D:$D)*(Fixtures!$B:$B<>\"\")))","v":0},{"$f":"IF(Teams!A14=\"\",\"\",SUMIFS(Fixtures!$B:$B,Fixtures!$A:$A,Calculations!$C15,Fixtures!$B:$B,\">=0\"))","v":0},{"$f":"IF(Teams!A14=\"\",\"\",SUMIFS(Fixtures!$D:$D,Fixtures!$A:$A,Calculations!$C15,Fixtures!$D:$D,\">=0\"))","v":0},{"$f":"IF(Teams!A14=\"\",\"\",H15-I15)","v":0},{"$f":"IF(Teams!A14=\"\",\"\",$E15*Data!$B$2+$G15*Data!$B$3)","v":0},{"$f":"IF(Teams!A14=\"\",\"\",SUMPRODUCT((Fixtures!$E:$E=Calculations!$C15)*(Fixtures!$D:$D>Fixtures!$B:$B)))","v":0},{"$f":"IF(Teams!A14=\"\",\"\",SUMPRODUCT((Fixtures!$E:$E=Calculations!$C15)*(Fixtures!$D:$D<Fixtures!$B:$B)))","v":0},{"$f":"IF(Teams!A14=\"\",\"\",SUMPRODUCT((Fixtures!$E:$E=Calculations!$C15)*(Fixtures!$D:$D=Fixtures!$B:$B)*(Fixtures!$D:$D<>\"\")))","v":0},{"$f":"IF(Teams!A14=\"\",\"\",SUMIFS(Fixtures!$D:$D,Fixtures!$E:$E,Calculations!$C15,Fixtures!$D:$D,\">=0\"))","v":0},{"$f":"IF(Teams!A14=\"\",\"\",SUMIFS(Fixtures!$B:$B,Fixtures!$E:$E,Calculations!$C15,Fixtures!$B:$B,\">=0\"))","v":0},{"$f":"IF(Teams!A14=\"\",\"\",O15-P15)","v":0},{"$f":"IF(Teams!A14=\"\",\"\",$L15*Data!$B$2+$N15*Data!$B$3)","v":0},{"$f":"IF(Teams!A14=\"\",\"\",J15+Q15)","v":0},{"$f":"IF(Teams!A14=\"\",\"\",H15+O15)","v":0},{"$f":"IF(Teams!A14=\"\",\"\",K15+R15)","v":0},{"$f":"IF(Teams!A14=\"\",\"\",RANK(U15,$U$3:$U$22))","v":1},{"$f":"IF(Teams!A14=\"\",\"\",SUMPRODUCT(($U$3:$U$22=U15)*($S$3:$S$22>S15)))","v":0},{"$f":"IF(Teams!A14=\"\",\"\",SUMPRODUCT(($U$3:$U$22=U15)*($S$3:$S$22=S15)*($T$3:$T$22>T15)))","v":0}]
[{"$f":"IF(Teams!A15=\"\",\"\",RANK($B16,$B$3:$B$20,1)+COUNTIF($B$3:$B16,$B16)-1)","v":14},{"$f":"IF(Teams!A15=\"\",\"\",V16+W16+X16)","v":1},{"$f":"IF(Teams!A15=\"\",\"\",Teams!A15)","v":"Stoke City"},{"$f":"IF(Teams!A15=\"\",\"\",COUNTIFS(Fixtures!$A:$A,Calculations!$C16,Fixtures!$B:$B,\">=0\")+COUNTIFS(Fixtures!$E:$E,Calculations!$C16,Fixtures!$D:$D,\">=0\"))","v":0},{"$f":"IF(Teams!A15=\"\",\"\",SUMPRODUCT((Fixtures!$A:$A=Calculations!$C16)*(Fixtures!$B:$B>Fixtures!$D:$D)))","v":0},{"$f":"IF(Teams!A15=\"\",\"\",SUMPRODUCT((Fixtures!$A:$A=Calculations!$C16)*(Fixtures!$B:$B<Fixtures!$D:$D)))","v":0},{"$f":"IF(Teams!A15=\"\",\"\",SUMPRODUCT((Fixtures!$A:$A=Calculations!$C16)*(Fixtures!$B:$B=Fixtures!$D:$D)*(Fixtures!$B:$B<>\"\")))","v":0},{"$f":"IF(Teams!A15=\"\",\"\",SUMIFS(Fixtures!$B:$B,Fixtures!$A:$A,Calculations!$C16,Fixtures!$B:$B,\">=0\"))","v":0},{"$f":"IF(Teams!A15=\"\",\"\",SUMIFS(Fixtures!$D:$D,Fixtures!$A:$A,Calculations!$C16,Fixtures!$D:$D,\">=0\"))","v":0},{"$f":"IF(Teams!A15=\"\",\"\",H16-I16)","v":0},{"$f":"IF(Teams!A15=\"\",\"\",$E16*Data!$B$2+$G16*Data!$B$3)","v":0},{"$f":"IF(Teams!A15=\"\",\"\",SUMPRODUCT((Fixtures!$E:$E=Calculations!$C16)*(Fixtures!$D:$D>Fixtures!$B:$B)))","v":0},{"$f":"IF(Teams!A15=\"\",\"\",SUMPRODUCT((Fixtures!$E:$E=Calculations!$C16)*(Fixtures!$D:$D<Fixtures!$B:$B)))","v":0},{"$f":"IF(Teams!A15=\"\",\"\",SUMPRODUCT((Fixtures!$E:$E=Calculations!$C16)*(Fixtures!$D:$D=Fixtures!$B:$B)*(Fixtures!$D:$D<>\"\")))","v":0},{"$f":"IF(Teams!A15=\"\",\"\",SUMIFS(Fixtures!$D:$D,Fixtures!$E:$E,Calculations!$C16,Fixtures!$D:$D,\">=0\"))","v":0},{"$f":"IF(Teams!A15=\"\",\"\",SUMIFS(Fixtures!$B:$B,Fixtures!$E:$E,Calculations!$C16,Fixtures!$B:$B,\">=0\"))","v":0},{"$f":"IF(Teams!A15=\"\",\"\",O16-P16)","v":0},{"$f":"IF(Teams!A15=\"\",\"\",$L16*Data!$B$2+$N16*Data!$B$3)","v":0},{"$f":"IF(Teams!A15=\"\",\"\",J16+Q16)","v":0},{"$f":"IF(Teams!A15=\"\",\"\",H16+O16)","v":0},{"$f":"IF(Teams!A15=\"\",\"\",K16+R16)","v":0},{"$f":"IF(Teams!A15=\"\",\"\",RANK(U16,$U$3:$U$22))","v":1},{"$f":"IF(Teams!A15=\"\",\"\",SUMPRODUCT(($U$3:$U$22=U16)*($S$3:$S$22>S16)))","v":0},{"$f":"IF(Teams!A15=\"\",\"\",SUMPRODUCT(($U$3:$U$22=U16)*($S$3:$S$22=S16)*($T$3:$T$22>T16)))","v":0}]
[{"$f":"IF(Teams!A16=\"\",\"\",RANK($B17,$B$3:$B$20,1)+COUNTIF($B$3:$B17,$B17)-1)","v":15},{"$f":"IF(Teams!A16=\"\",\"\",V17+W17+X17)","v":1},{"$f":"IF(Teams!A16=\"\",\"\",Teams!A16)","v":"Sunderland"},{"$f":"IF(Teams!A16=\"\",\"\",COUNTIFS(Fixtures!$A:$A,Calculations!$C17,Fixtures!$B:$B,\">=0\")+COUNTIFS(Fixtures!$E:$E,Calculations!$C17,Fixtures!$D:$D,\">=0\"))","v":0},{"$f":"IF(Teams!A16=\"\",\"\",SUMPRODUCT((Fixtures!$A:$A=Calculations!$C17)*(Fixtures!$B:$B>Fixtures!$D:$D)))","v":0},{"$f":"IF(Teams!A16=\"\",\"\",SUMPRODUCT((Fixtures!$A:$A=Calculations!$C17)*(Fixtures!$B:$B<Fixtures!$D:$D)))","v":0},{"$f":"IF(Teams!A16=\"\",\"\",SUMPRODUCT((Fixtures!$A:$A=Calculations!$C17)*(Fixtures!$B:$B=Fixtures!$D:$D)*(Fixtures!$B:$B<>\"\")))","v":0},{"$f":"IF(Teams!A16=\"\",\"\",SUMIFS(Fixtures!$B:$B,Fixtures!$A:$A,Calculations!$C17,Fixtures!$B:$B,\">=0\"))","v":0},{"$f":"IF(Teams!A16=\"\",\"\",SUMIFS(Fixtures!$D:$D,Fixtures!$A:$A,Calculations!$C17,Fixtures!$D:$D,\">=0\"))","v":0},{"$f":"IF(Teams!A16=\"\",\"\",H17-I17)","v":0},{"$f":"IF(Teams!A16=\"\",\"\",$E17*Data!$B$2+$G17*Data!$B$3)","v":0},{"$f":"IF(Teams!A16=\"\",\"\",SUMPRODUCT((Fixtures!$E:$E=Calculations!$C17)*(Fixtures!$D:$D>Fixtures!$B:$B)))","v":0},{"$f":"IF(Teams!A16=\"\",\"\",SUMPRODUCT((Fixtures!$E:$E=Calculations!$C17)*(Fixtures!$D:$D<Fixtures!$B:$B)))","v":0},{"$f":"IF(Teams!A16=\"\",\"\",SUMPRODUCT((Fixtures!$E:$E=Calculations!$C17)*(Fixtures!$D:$D=Fixtures!$B:$B)*(Fixtures!$D:$D<>\"\")))","v":0},{"$f":"IF(Teams!A16=\"\",\"\",SUMIFS(Fixtures!$D:$D,Fixtures!$E:$E,Calculations!$C17,Fixtures!$D:$D,\">=0\"))","v":0},{"$f":"IF(Teams!A16=\"\",\"\",SUMIFS(Fixtures!$B:$B,Fixtures!$E:$E,Calculations!$C17,Fixtures!$B:$B,\">=0\"))","v":0},{"$f":"IF(Teams!A16=\"\",\"\",O17-P17)","v":0},{"$f":"IF(Teams!A16=\"\",\"\",$L17*Data!$B$2+$N17*Data!$B$3)","v":0},{"$f":"IF(Teams!A16=\"\",\"\",J17+Q17)","v":0},{"$f":"IF(Teams!A16=\"\",\"\",H17+O17)","v":0},{"$f":"IF(Teams!A16=\"\",\"\",K17+R17)","v":0},{"$f":"IF(Teams!A16=\"\",\"\",RANK(U17,$U$3:$U$22))","v":1},{"$f":"IF(Teams!A16=\"\",\"\",SUMPRODUCT(($U$3:$U$22=U17)*($S$3:$S$22>S17)))","v":0},{"$f":"IF(Teams!A16=\"\",\"\",SUMPRODUCT(($U$3:$U$22=U17)*($S$3:$S$22=S17)*($T$3:$T$22>T17)))","v":0}]
[{"$f":"IF(Teams!A17=\"\",\"\",RANK($B18,$B$3:$B$20,1)+COUNTIF($B$3:$B18,$B18)-1)","v":16},{"$f":"IF(Teams!A17=\"\",\"\",V18+W18+X18)","v":1},{"$f":"IF(Teams!A17=\"\",\"\",Teams!A17)","v":"Swansea City"},{"$f":"IF(Teams!A17=\"\",\"\",COUNTIFS(Fixtures!$A:$A,Calculations!$C18,Fixtures!$B:$B,\">=0\")+COUNTIFS(Fixtures!$E:$E,Calculations!$C18,Fixtures!$D:$D,\">=0\"))","v":0},{"$f":"IF(Teams!A17=\"\",\"\",SUMPRODUCT((Fixtures!$A:$A=Calculations!$C18)*(Fixtures!$B:$B>Fixtures!$D:$D)))","v":0},{"$f":"IF(Teams!A17=\"\",\"\",SUMPRODUCT((Fixtures!$A:$A=Calculations!$C18)*(Fixtures!$B:$B<Fixtures!$D:$D)))","v":0},{"$f":"IF(Teams!A17=\"\",\"\",SUMPRODUCT((Fixtures!$A:$A=Calculations!$C18)*(Fixtures!$B:$B=Fixtures!$D:$D)*(Fixtures!$B:$B<>\"\")))","v":0},{"$f":"IF(Teams!A17=\"\",\"\",SUMIFS(Fixtures!$B:$B,Fixtures!$A:$A,Calculations!$C18,Fixtures!$B:$B,\">=0\"))","v":0},{"$f":"IF(Teams!A17=\"\",\"\",SUMIFS(Fixtures!$D:$D,Fixtures!$A:$A,Calculations!$C18,Fixtures!$D:$D,\">=0\"))","v":0},{"$f":"IF(Teams!A17=\"\",\"\",H18-I18)","v":0},{"$f":"IF(Teams!A17=\"\",\"\",$E18*Data!$B$2+$G18*Data!$B$3)","v":0},{"$f":"IF(Teams!A17=\"\",\"\",SUMPRODUCT((Fixtures!$E:$E=Calculations!$C18)*(Fixtures!$D:$D>Fixtures!$B:$B)))","v":0},{"$f":"IF(Teams!A17=\"\",\"\",SUMPRODUCT((Fixtures!$E:$E=Calculations!$C18)*(Fixtures!$D:$D<Fixtures!$B:$B)))","v":0},{"$f":"IF(Teams!A17=\"\",\"\",SUMPRODUCT((Fixtures!$E:$E=Calculations!$C18)*(Fixtures!$D:$D=Fixtures!$B:$B)*(Fixtures!$D:$D<>\"\")))","v":0},{"$f":"IF(Teams!A17=\"\",\"\",SUMIFS(Fixtures!$D:$D,Fixtures!$E:$E,Calculations!$C18,Fixtures!$D:$D,\">=0\"))","v":0},{"$f":"IF(Teams!A17=\"\",\"\",SUMIFS(Fixtures!$B:$B,Fixtures!$E:$E,Calculations!$C18,Fixtures!$B:$B,\">=0\"))","v":0},{"$f":"IF(Teams!A17=\"\",\"\",O18-P18)","v":0},{"$f":"IF(Teams!A17=\"\",\"\",$L18*Data!$B$2+$N18*Data!$B$3)","v":0},{"$f":"IF(Teams!A17=\"\",\"\",J18+Q18)","v":0},{"$f":"IF(Teams!A17=\"\",\"\",H18+O18)","v":0},{"$f":"IF(Teams!A17=\"\",\"\",K18+R18)","v":0},{"$f":"IF(Teams!A17=\"\",\"\",RANK(U18,$U$3:$U$22))","v":1},{"$f":"IF(Teams!A17=\"\",\"\",SUMPRODUCT(($U$3:$U$22=U18)*($S$3:$S$22>S18)))","v":0},{"$f":"IF(Teams!A17=\"\",\"\",SUMPRODUCT(($U$3:$U$22=U18)*($S$3:$S$22=S18)*($T$3:$T$22>T18)))","v":0}]
[{"$f":"IF(Teams!A18=\"\",\"\",RANK($B19,$B$3:$B$20,1)+COUNTIF($B$3:$B19,$B19)-1)","v":17},{"$f":"IF(Teams!A18=\"\",\"\",V19+W19+X19)","v":1},{"$f":"IF(Teams!A18=\"\",\"\",Teams!A18)","v":"Tottenham Hotspur"},{"$f":"IF(Teams!A18=\"\",\"\",COUNTIFS(Fixtures!$A:$A,Calculations!$C19,Fixtures!$B:$B,\">=0\")+COUNTIFS(Fixtures!$E:$E,Calculations!$C19,Fixtures!$D:$D,\">=0\"))","v":0},{"$f":"IF(Teams!A18=\"\",\"\",SUMPRODUCT((Fixtures!$A:$A=Calculations!$C19)*(Fixtures!$B:$B>Fixtures!$D:$D)))","v":0},{"$f":"IF(Teams!A18=\"\",\"\",SUMPRODUCT((Fixtures!$A:$A=Calculations!$C19)*(Fixtures!$B:$B<Fixtures!$D:$D)))","v":0},{"$f":"IF(Teams!A18=\"\",\"\",SUMPRODUCT((Fixtures!$A:$A=Calculations!$C19)*(Fixtures!$B:$B=Fixtures!$D:$D)*(Fixtures!$B:$B<>\"\")))","v":0},{"$f":"IF(Teams!A18=\"\",\"\",SUMIFS(Fixtures!$B:$B,Fixtures!$A:$A,Calculations!$C19,Fixtures!$B:$B,\">=0\"))","v":0},{"$f":"IF(Teams!A18=\"\",\"\",SUMIFS(Fixtures!$D:$D,Fixtures!$A:$A,Calculations!$C19,Fixtures!$D:$D,\">=0\"))","v":0},{"$f":"IF(Teams!A18=\"\",\"\",H19-I19)","v":0},{"$f":"IF(Teams!A18=\"\",\"\",$E19*Data!$B$2+$G19*Data!$B$3)","v":0},{"$f":"IF(Teams!A18=\"\",\"\",SUMPRODUCT((Fixtures!$E:$E=Calculations!$C19)*(Fixtures!$D:$D>Fixtures!$B:$B)))","v":0},{"$f":"IF(Teams!A18=\"\",\"\",SUMPRODUCT((Fixtures!$E:$E=Calculations!$C19)*(Fixtures!$D:$D<Fixtures!$B:$B)))","v":0},{"$f":"IF(Teams!A18=\"\",\"\",SUMPRODUCT((Fixtures!$E:$E=Calculations!$C19)*(Fixtures!$D:$D=Fixtures!$B:$B)*(Fixtures!$D:$D<>\"\")))","v":0},{"$f":"IF(Teams!A18=\"\",\"\",SUMIFS(Fixtures!$D:$D,Fixtures!$E:$E,Calculations!$C19,Fixtures!$D:$D,\">=0\"))","v":0},{"$f":"IF(Teams!A18=\"\",\"\",SUMIFS(Fixtures!$B:$B,Fixtures!$E:$E,Calculations!$C19,Fixtures!$B:$B,\">=0\"))","v":0},{"$f":"IF(Teams!A18=\"\",\"\",O19-P19)","v":0},{"$f":"IF(Teams!A18=\"\",\"\",$L19*Data!$B$2+$N19*Data!$B$3)","v":0},{"$f":"IF(Teams!A18=\"\",\"\",J19+Q19)","v":0},{"$f":"IF(Teams!A18=\"\",\"\",H19+O19)","v":0},{"$f":"IF(Teams!A18=\"\",\"\",K19+R19)","v":0},{"$f":"IF(Teams!A18=\"\",\"\",RANK(U19,$U$3:$U$22))","v":1},{"$f":"IF(Teams!A18=\"\",\"\",SUMPRODUCT(($U$3:$U$22=U19)*($S$3:$S$22>S19)))","v":0},{"$f":"IF(Teams!A18=\"\",\"\",SUMPRODUCT(($U$3:$U$22=U19)*($S$3:$S$22=S19)*($T$3:$T$22>T19)))","v":0}]
[{"$f":"IF(Teams!A19=\"\",\"\",RANK($B20,$B$3:$B$20,1)+COUNTIF($B$3:$B20,$B20)-1)","v":18},{"$f":"IF(Teams!A19=\"\",\"\",V20+W20+X20)","v":1},{"$f":"IF(Teams!A19=\"\",\"\",Teams!A19)","v":"West Bromwich Albion"},{"$f":"IF(Teams!A19=\"\",\"\",COUNTIFS(Fixtures!$A:$A,Calculations!$C20,Fixtures!$B:$B,\">=0\")+COUNTIFS(Fixtures!$E:$E,Calculations!$C20,Fixtures!$D:$D,\">=0\"))","v":0},{"$f":"IF(Teams!A19=\"\",\"\",SUMPRODUCT((Fixtures!$A:$A=Calculations!$C20)*(Fixtures!$B:$B>Fixtures!$D:$D)))","v":0},{"$f":"IF(Teams!A19=\"\",\"\",SUMPRODUCT((Fixtures!$A:$A=Calculations!$C20)*(Fixtures!$B:$B<Fixtures!$D:$D)))","v":0},{"$f":"IF(Teams!A19=\"\",\"\",SUMPRODUCT((Fixtures!$A:$A=Calculations!$C20)*(Fixtures!$B:$B=Fixtures!$D:$D)*(Fixtures!$B:$B<>\"\")))","v":0},{"$f":"IF(Teams!A19=\"\",\"\",SUMIFS(Fixtures!$B:$B,Fixtures!$A:$A,Calculations!$C20,Fixtures!$B:$B,\">=0\"))","v":0},{"$f":"IF(Teams!A19=\"\",\"\",SUMIFS(Fixtures!$D:$D,Fixtures!$A:$A,Calculations!$C20,Fixtures!$D:$D,\">=0\"))","v":0},{"$f":"IF(Teams!A19=\"\",\"\",H20-I20)","v":0},{"$f":"IF(Teams!A19=\"\",\"\",$E20*Data!$B$2+$G20*Data!$B$3)","v":0},{"$f":"IF(Teams!A19=\"\",\"\",SUMPRODUCT((Fixtures!$E:$E=Calculations!$C20)*(Fixtures!$D:$D>Fixtures!$B:$B)))","v":0},{"$f":"IF(Teams!A19=\"\",\"\",SUMPRODUCT((Fixtures!$E:$E=Calculations!$C20)*(Fixtures!$D:$D<Fixtures!$B:$B)))","v":0},{"$f":"IF(Teams!A19=\"\",\"\",SUMPRODUCT((Fixtures!$E:$E=Calculations!$C20)*(Fixtures!$D:$D=Fixtures!$B:$B)*(Fixtures!$D:$D<>\"\")))","v":0},{"$f":"IF(Teams!A19=\"\",\"\",SUMIFS(Fixtures!$D:$D,Fixtures!$E:$E,Calculations!$C20,Fixtures!$D:$D,\">=0\"))","v":0},{"$f":"IF(Teams!A19=\"\",\"\",SUMIFS(Fixtures!$B:$B,Fixtures!$E:$E,Calculations!$C20,Fixtures!$B:$B,\">=0\"))","v":0},{"$f":"IF(Teams!A19=\"\",\"\",O20-P20)","v":0},{"$f":"IF(Teams!A19=\"\",\"\",$L20*Data!$B$2+$N20*Data!$B$3)","v":0},{"$f":"IF(Teams!A19=\"\",\"\",J20+Q20)","v":0},{"$f":"IF(Teams!A19=\"\",\"\",H20+O20)","v":0},{"$f":"IF(Teams!A19=\"\",\"\",K20+R20)","v":0},{"$f":"IF(Teams!A19=\"\",\"\",RANK(U20,$U$3:$U$22))","v":1},{"$f":"IF(Teams!A19=\"\",\"\",SUMPRODUCT(($U$3:$U$22=U20)*($S$3:$S$22>S20)))","v":0},{"$f":"IF(Teams!A19=\"\",\"\",SUMPRODUCT(($U$3:$U$22=U20)*($S$3:$S$22=S20)*($T$3:$T$22>T20)))","v":0}]
[{"$f":"IF(Teams!A20=\"\",\"\",RANK($B21,$B$3:$B$20,1)+COUNTIF($B$3:$B21,$B21)-1)","v":19},{"$f":"IF(Teams!A20=\"\",\"\",V21+W21+X21)","v":1},{"$f":"IF(Teams!A20=\"\",\"\",Teams!A20)","v":"Wigan Athletic"},{"$f":"IF(Teams!A20=\"\",\"\",COUNTIFS(Fixtures!$A:$A,Calculations!$C21,Fixtures!$B:$B,\">=0\")+COUNTIFS(Fixtures!$E:$E,Calculations!$C21,Fixtures!$D:$D,\">=0\"))","v":0},{"$f":"IF(Teams!A20=\"\",\"\",SUMPRODUCT((Fixtures!$A:$A=Calculations!$C21)*(Fixtures!$B:$B>Fixtures!$D:$D)))","v":0},{"$f":"IF(Teams!A20=\"\",\"\",SUMPRODUCT((Fixtures!$A:$A=Calculations!$C21)*(Fixtures!$B:$B<Fixtures!$D:$D)))","v":0},{"$f":"IF(Teams!A20=\"\",\"\",SUMPRODUCT((Fixtures!$A:$A=Calculations!$C21)*(Fixtures!$B:$B=Fixtures!$D:$D)*(Fixtures!$B:$B<>\"\")))","v":0},{"$f":"IF(Teams!A20=\"\",\"\",SUMIFS(Fixtures!$B:$B,Fixtures!$A:$A,Calculations!$C21,Fixtures!$B:$B,\">=0\"))","v":0},{"$f":"IF(Teams!A20=\"\",\"\",SUMIFS(Fixtures!$D:$D,Fixtures!$A:$A,Calculations!$C21,Fixtures!$D:$D,\">=0\"))","v":0},{"$f":"IF(Teams!A20=\"\",\"\",H21-I21)","v":0},{"$f":"IF(Teams!A20=\"\",\"\",$E21*Data!$B$2+$G21*Data!$B$3)","v":0},{"$f":"IF(Teams!A20=\"\",\"\",SUMPRODUCT((Fixtures!$E:$E=Calculations!$C21)*(Fixtures!$D:$D>Fixtures!$B:$B)))","v":0},{"$f":"IF(Teams!A20=\"\",\"\",SUMPRODUCT((Fixtures!$E:$E=Calculations!$C21)*(Fixtures!$D:$D<Fixtures!$B:$B)))","v":0},{"$f":"IF(Teams!A20=\"\",\"\",SUMPRODUCT((Fixtures!$E:$E=Calculations!$C21)*(Fixtures!$D:$D=Fixtures!$B:$B)*(Fixtures!$D:$D<>\"\")))","v":0},{"$f":"IF(Teams!A20=\"\",\"\",SUMIFS(Fixtures!$D:$D,Fixtures!$E:$E,Calculations!$C21,Fixtures!$D:$D,\">=0\"))","v":0},{"$f":"IF(Teams!A20=\"\",\"\",SUMIFS(Fixtures!$B:$B,Fixtures!$E:$E,Calculations!$C21,Fixtures!$B:$B,\">=0\"))","v":0},{"$f":"IF(Teams!A20=\"\",\"\",O21-P21)","v":0},{"$f":"IF(Teams!A20=\"\",\"\",$L21*Data!$B$2+$N21*Data!$B$3)","v":0},{"$f":"IF(Teams!A20=\"\",\"\",J21+Q21)","v":0},{"$f":"IF(Teams!A20=\"\",\"\",H21+O21)","v":0},{"$f":"IF(Teams!A20=\"\",\"\",K21+R21)","v":0},{"$f":"IF(Teams!A20=\"\",\"\",RANK(U21,$U$3:$U$22))","v":1},{"$f":"IF(Teams!A20=\"\",\"\",SUMPRODUCT(($U$3:$U$22=U21)*($S$3:$S$22>S21)))","v":0},{"$f":"IF(Teams!A20=\"\",\"\",SUMPRODUCT(($U$3:$U$22=U21)*($S$3:$S$22=S21)*($T$3:$T$22>T21)))","v":0}]
[{"$f":"IF(Teams!A21=\"\",\"\",RANK($B22,$B$3:$B$20,1)+COUNTIF($B$3:$B22,$B22)-1)","v":20},{"$f":"IF(Teams!A21=\"\",\"\",V22+W22+X22)","v":1},{"$f":"IF(Teams!A21=\"\",\"\",Teams!A21)","v":"Wolves"},{"$f":"IF(Teams!A21=\"\",\"\",COUNTIFS(Fixtures!$A:$A,Calculations!$C22,Fixtures!$B:$B,\">=0\")+COUNTIFS(Fixtures!$E:$E,Calculations!$C22,Fixtures!$D:$D,\">=0\"))","v":0},{"$f":"IF(Teams!A21=\"\",\"\",SUMPRODUCT((Fixtures!$A:$A=Calculations!$C22)*(Fixtures!$B:$B>Fixtures!$D:$D)))","v":0},{"$f":"IF(Teams!A21=\"\",\"\",SUMPRODUCT((Fixtures!$A:$A=Calculations!$C22)*(Fixtures!$B:$B<Fixtures!$D:$D)))","v":0},{"$f":"IF(Teams!A21=\"\",\"\",SUMPRODUCT((Fixtures!$A:$A=Calculations!$C22)*(Fixtures!$B:$B=Fixtures!$D:$D)*(Fixtures!$B:$B<>\"\")))","v":0},{"$f":"IF(Teams!A21=\"\",\"\",SUMIFS(Fixtures!$B:$B,Fixtures!$A:$A,Calculations!$C22,Fixtures!$B:$B,\">=0\"))","v":0},{"$f":"IF(Teams!A21=\"\",\"\",SUMIFS(Fixtures!$D:$D,Fixtures!$A:$A,Calculations!$C22,Fixtures!$D:$D,\">=0\"))","v":0},{"$f":"IF(Teams!A21=\"\",\"\",H22-I22)","v":0},{"$f":"IF(Teams!A21=\"\",\"\",$E22*Data!$B$2+$G22*Data!$B$3)","v":0},{"$f":"IF(Teams!A21=\"\",\"\",SUMPRODUCT((Fixtures!$E:$E=Calculations!$C22)*(Fixtures!$D:$D>Fixtures!$B:$B)))","v":0},{"$f":"IF(Teams!A21=\"\",\"\",SUMPRODUCT((Fixtures!$E:$E=Calculations!$C22)*(Fixtures!$D:$D<Fixtures!$B:$B)))","v":0},{"$f":"IF(Teams!A21=\"\",\"\",SUMPRODUCT((Fixtures!$E:$E=Calculations!$C22)*(Fixtures!$D:$D=Fixtures!$B:$B)*(Fixtures!$D:$D<>\"\")))","v":0},{"$f":"IF(Teams!A21=\"\",\"\",SUMIFS(Fixtures!$D:$D,Fixtures!$E:$E,Calculations!$C22,Fixtures!$D:$D,\">=0\"))","v":0},{"$f":"IF(Teams!A21=\"\",\"\",SUMIFS(Fixtures!$B:$B,Fixtures!$E:$E,Calculations!$C22,Fixtures!$B:$B,\">=0\"))","v":0},{"$f":"IF(Teams!A21=\"\",\"\",O22-P22)","v":0},{"$f":"IF(Teams!A21=\"\",\"\",$L22*Data!$B$2+$N22*Data!$B$3)","v":0},{"$f":"IF(Teams!A21=\"\",\"\",J22+Q22)","v":0},{"$f":"IF(Teams!A21=\"\",\"\",H22+O22)","v":0},{"$f":"IF(Teams!A21=\"\",\"\",K22+R22)","v":0},{"$f":"IF(Teams!A21=\"\",\"\",RANK(U22,$U$3:$U$22))","v":1},{"$f":"IF(Teams!A21=\"\",\"\",SUMPRODUCT(($U$3:$U$22=U22)*($S$3:$S$22>S22)))","v":0},{"$f":"IF(Teams!A21=\"\",\"\",SUMPRODUCT(($U$3:$U$22=U22)*($S$3:$S$22=S22)*($T$3:$T$22>T22)))","v":0}]
[{"$f":"IF(Teams!A22=\"\",\"\",RANK($B23,$B$3:$B$20,1)+COUNTIF($B$3:$B23,$B23)-1)","v":""},{"$f":"IF(Teams!A22=\"\",\"\",V23+W23+X23)","v":""},{"$f":"IF(Teams!A22=\"\",\"\",Teams!A22)","v":""},{"$f":"IF(Teams!A22=\"\",\"\",COUNTIFS(Fixtures!$A:$A,Calculations!$C23,Fixtures!$B:$B,\">=0\")+COUNTIFS(Fixtures!$E:$E,Calculations!$C23,Fixtures!$D:$D,\">=0\"))","v":""},{"$f":"IF(Teams!A22=\"\",\"\",SUMPRODUCT((Fixtures!$A:$A=Calculations!$C23)*(Fixtures!$B:$B>Fixtures!$D:$D)))","v":""},{"$f":"IF(Teams!A22=\"\",\"\",SUMPRODUCT((Fixtures!$A:$A=Calculations!$C23)*(Fixtures!$B:$B<Fixtures!$D:$D)))","v":""},{"$f":"IF(Teams!A22=\"\",\"\",SUMPRODUCT((Fixtures!$A:$A=Calculations!$C23)*(Fixtures!$B:$B=Fixtures!$D:$D)*(Fixtures!$B:$B<>\"\")))","v":""},{"$f":"IF(Teams!A22=\"\",\"\",SUMIFS(Fixtures!$B:$B,Fixtures!$A:$A,Calculations!$C23,Fixtures!$B:$B,\">=0\"))","v":""},{"$f":"IF(Teams!A22=\"\",\"\",SUMIFS(Fixtures!$D:$D,Fixtures!$A:$A,Calculations!$C23,Fixtures!$D:$D,\">=0\"))","v":""},{"$f":"IF(Teams!A22=\"\",\"\",H23-I23)","v":""},{"$f":"IF(Teams!A22=\"\",\"\",$E23*Data!$B$2+$G23*Data!$B$3)","v":""},{"$f":"IF(Teams!A22=\"\",\"\",SUMPRODUCT((Fixtures!$E:$E=Calculations!$C23)*(Fixtures!$D:$D>Fixtures!$B:$B)))","v":""},{"$f":"IF(Teams!A22=\"\",\"\",SUMPRODUCT((Fixtures!$E:$E=Calculations!$C23)*(Fixtures!$D:$D<Fixtures!$B:$B)))","v":""},{"$f":"IF(Teams!A22=\"\",\"\",SUMPRODUCT((Fixtures!$E:$E=Calculations!$C23)*(Fixtures!$D:$D=Fixtures!$B:$B)*(Fixtures!$D:$D<>\"\")))","v":""},{"$f":"IF(Teams!A22=\"\",\"\",SUMIFS(Fixtures!$D:$D,Fixtures!$E:$E,Calculations!$C23,Fixtures!$D:$D,\">=0\"))","v":""},{"$f":"IF(Teams!A22=\"\",\"\",SUMIFS(Fixtures!$B:$B,Fixtures!$E:$E,Calculations!$C23,Fixtures!$B:$B,\">=0\"))","v":""},{"$f":"IF(Teams!A22=\"\",\"\",O23-P23)","v":""},{"$f":"IF(Teams!A22=\"\",\"\",$L23*Data!$B$2+$N23*Data!$B$3)","v":""},{"$f":"IF(Teams!A22=\"\",\"\",J23+Q23)","v":""},{"$f":"IF(Teams!A22=\"\",\"\",H23+O23)","v":""},{"$f":"IF(Teams!A22=\"\",\"\",K23+R23)","v":""},{"$f":"IF(Teams!A22=\"\",\"\",RANK(U23,$U$3:$U$22))","v":""},{"$f":"IF(Teams!A22=\"\",\"\",SUMPRODUCT(($U$3:$U$22=U23)*($S$3:$S$22>S23)))","v":""},{"$f":"IF(Teams!A22=\"\",\"\",SUMPRODUCT(($U$3:$U$22=U23)*($S$3:$S$22=S23)*($T$3:$T$22>T23)))","v":""}]
[{"$f":"IF(Teams!A23=\"\",\"\",RANK($B24,$B$3:$B$20,1)+COUNTIF($B$3:$B24,$B24)-1)","v":""},{"$f":"IF(Teams!A23=\"\",\"\",V24+W24+X24)","v":""},{"$f":"IF(Teams!A23=\"\",\"\",Teams!A23)","v":""},{"$f":"IF(Teams!A23=\"\",\"\",COUNTIFS(Fixtures!$A:$A,Calculations!$C24,Fixtures!$B:$B,\">=0\")+COUNTIFS(Fixtures!$E:$E,Calculations!$C24,Fixtures!$D:$D,\">=0\"))","v":""},{"$f":"IF(Teams!A23=\"\",\"\",SUMPRODUCT((Fixtures!$A:$A=Calculations!$C24)*(Fixtures!$B:$B>Fixtures!$D:$D)))","v":""},{"$f":"IF(Teams!A23=\"\",\"\",SUMPRODUCT((Fixtures!$A:$A=Calculations!$C24)*(Fixtures!$B:$B<Fixtures!$D:$D)))","v":""},{"$f":"IF(Teams!A23=\"\",\"\",SUMPRODUCT((Fixtures!$A:$A=Calculations!$C24)*(Fixtures!$B:$B=Fixtures!$D:$D)*(Fixtures!$B:$B<>\"\")))","v":""},{"$f":"IF(Teams!A23=\"\",\"\",SUMIFS(Fixtures!$B:$B,Fixtures!$A:$A,Calculations!$C24,Fixtures!$B:$B,\">=0\"))","v":""},{"$f":"IF(Teams!A23=\"\",\"\",SUMIFS(Fixtures!$D:$D,Fixtures!$A:$A,Calculations!$C24,Fixtures!$D:$D,\">=0\"))","v":""},{"$f":"IF(Teams!A23=\"\",\"\",H24-I24)","v":""},{"$f":"IF(Teams!A23=\"\",\"\",$E24*Data!$B$2+$G24*Data!$B$3)","v":""},{"$f":"IF(Teams!A23=\"\",\"\",SUMPRODUCT((Fixtures!$E:$E=Calculations!$C24)*(Fixtures!$D:$D>Fixtures!$B:$B)))","v":""},{"$f":"IF(Teams!A23=\"\",\"\",SUMPRODUCT((Fixtures!$E:$E=Calculations!$C24)*(Fixtures!$D:$D<Fixtures!$B:$B)))","v":""},{"$f":"IF(Teams!A23=\"\",\"\",SUMPRODUCT((Fixtures!$E:$E=Calculations!$C24)*(Fixtures!$D:$D=Fixtures!$B:$B)*(Fixtures!$D:$D<>\"\")))","v":""},{"$f":"IF(Teams!A23=\"\",\"\",SUMIFS(Fixtures!$D:$D,Fixtures!$E:$E,Calculations!$C24,Fixtures!$D:$D,\">=0\"))","v":""},{"$f":"IF(Teams!A23=\"\",\"\",SUMIFS(Fixtures!$B:$B,Fixtures!$E:$E,Calculations!$C24,Fixtures!$B:$B,\">=0\"))","v":""},{"$f":"IF(Teams!A23=\"\",\"\",O24-P24)","v":""},{"$f":"IF(Teams!A23=\"\",\"\",$L24*Data!$B$2+$N24*Data!$B$3)","v":""},{"$f":"IF(Teams!A23=\"\",\"\",J24+Q24)","v":""},{"$f":"IF(Teams!A23=\"\",\"\",H24+O24)","v":""},{"$f":"IF(Teams!A23=\"\",\"\",K24+R24)","v":""},{"$f":"IF(Teams!A23=\"\",\"\",RANK(U24,$U$3:$U$22))","v":""},{"$f":"IF(Teams!A23=\"\",\"\",SUMPRODUCT(($U$3:$U$22=U24)*($S$3:$S$22>S24)))","v":""},{"$f":"IF(Teams!A23=\"\",\"\",SUMPRODUCT(($U$3:$U$22=U24)*($S$3:$S$22=S24)*($T$3:$T$22>T24)))","v":""}]
[{"$f":"IF(Teams!A24=\"\",\"\",RANK($B25,$B$3:$B$20,1)+COUNTIF($B$3:$B25,$B25)-1)","v":""},{"$f":"IF(Teams!A24=\"\",\"\",V25+W25+X25)","v":""},{"$f":"IF(Teams!A24=\"\",\"\",Teams!A24)","v":""},{"$f":"IF(Teams!A24=\"\",\"\",COUNTIFS(Fixtures!$A:$A,Calculations!$C25,Fixtures!$B:$B,\">=0\")+COUNTIFS(Fixtures!$E:$E,Calculations!$C25,Fixtures!$D:$D,\">=0\"))","v":""},{"$f":"IF(Teams!A24=\"\",\"\",SUMPRODUCT((Fixtures!$A:$A=Calculations!$C25)*(Fixtures!$B:$B>Fixtures!$D:$D)))","v":""},{"$f":"IF(Teams!A24=\"\",\"\",SUMPRODUCT((Fixtures!$A:$A=Calculations!$C25)*(Fixtures!$B:$B<Fixtures!$D:$D)))","v":""},{"$f":"IF(Teams!A24=\"\",\"\",SUMPRODUCT((Fixtures!$A:$A=Calculations!$C25)*(Fixtures!$B:$B=Fixtures!$D:$D)*(Fixtures!$B:$B<>\"\")))","v":""},{"$f":"IF(Teams!A24=\"\",\"\",SUMIFS(Fixtures!$B:$B,Fixtures!$A:$A,Calculations!$C25,Fixtures!$B:$B,\">=0\"))","v":""},{"$f":"IF(Teams!A24=\"\",\"\",SUMIFS(Fixtures!$D:$D,Fixtures!$A:$A,Calculations!$C25,Fixtures!$D:$D,\">=0\"))","v":""},{"$f":"IF(Teams!A24=\"\",\"\",H25-I25)","v":""},{"$f":"IF(Teams!A24=\"\",\"\",$E25*Data!$B$2+$G25*Data!$B$3)","v":""},{"$f":"IF(Teams!A24=\"\",\"\",SUMPRODUCT((Fixtures!$E:$E=Calculations!$C25)*(Fixtures!$D:$D>Fixtures!$B:$B)))","v":""},{"$f":"IF(Teams!A24=\"\",\"\",SUMPRODUCT((Fixtures!$E:$E=Calculations!$C25)*(Fixtures!$D:$D<Fixtures!$B:$B)))","v":""},{"$f":"IF(Teams!A24=\"\",\"\",SUMPRODUCT((Fixtures!$E:$E=Calculations!$C25)*(Fixtures!$D:$D=Fixtures!$B:$B)*(Fixtures!$D:$D<>\"\")))","v":""},{"$f":"IF(Teams!A24=\"\",\"\",SUMIFS(Fixtures!$D:$D,Fixtures!$E:$E,Calculations!$C25,Fixtures!$D:$D,\">=0\"))","v":""},{"$f":"IF(Teams!A24=\"\",\"\",SUMIFS(Fixtures!$B:$B,Fixtures!$E:$E,Calculations!$C25,Fixtures!$B:$B,\">=0\"))","v":""},{"$f":"IF(Teams!A24=\"\",\"\",O25-P25)","v":""},{"$f":"IF(Teams!A24=\"\",\"\",$L25*Data!$B$2+$N25*Data!$B$3)","v":""},{"$f":"IF(Teams!A24=\"\",\"\",J25+Q25)","v":""},{"$f":"IF(Teams!A24=\"\",\"\",H25+O25)","v":""},{"$f":"IF(Teams!A24=\"\",\"\",K25+R25)","v":""},{"$f":"IF(Teams!A24=\"\",\"\",RANK(U25,$U$3:$U$22))","v":""},{"$f":"IF(Teams!A24=\"\",\"\",SUMPRODUCT(($U$3:$U$22=U25)*($S$3:$S$22>S25)))","v":""},{"$f":"IF(Teams!A24=\"\",\"\",SUMPRODUCT(($U$3:$U$22=U25)*($S$3:$S$22=S25)*($T$3:$T$22>T25)))","v":""}]
[{"$f":"IF(Teams!A25=\"\",\"\",RANK($B26,$B$3:$B$20,1)+COUNTIF($B$3:$B26,$B26)-1)","v":""},{"$f":"IF(Teams!A25=\"\",\"\",V26+W26+X26)","v":""},{"$f":"IF(Teams!A25=\"\",\"\",Teams!A25)","v":""},{"$f":"IF(Teams!A25=\"\",\"\",COUNTIFS(Fixtures!$A:$A,Calculations!$C26,Fixtures!$B:$B,\">=0\")+COUNTIFS(Fixtures!$E:$E,Calculations!$C26,Fixtures!$D:$D,\">=0\"))","v":""},{"$f":"IF(Teams!A25=\"\",\"\",SUMPRODUCT((Fixtures!$A:$A=Calculations!$C26)*(Fixtures!$B:$B>Fixtures!$D:$D)))","v":""},{"$f":"IF(Teams!A25=\"\",\"\",SUMPRODUCT((Fixtures!$A:$A=Calculations!$C26)*(Fixtures!$B:$B<Fixtures!$D:$D)))","v":""},{"$f":"IF(Teams!A25=\"\",\"\",SUMPRODUCT((Fixtures!$A:$A=Calculations!$C26)*(Fixtures!$B:$B=Fixtures!$D:$D)*(Fixtures!$B:$B<>\"\")))","v":""},{"$f":"IF(Teams!A25=\"\",\"\",SUMIFS(Fixtures!$B:$B,Fixtures!$A:$A,Calculations!$C26,Fixtures!$B:$B,\">=0\"))","v":""},{"$f":"IF(Teams!A25=\"\",\"\",SUMIFS(Fixtures!$D:$D,Fixtures!$A:$A,Calculations!$C26,Fixtures!$D:$D,\">=0\"))","v":""},{"$f":"IF(Teams!A25=\"\",\"\",H26-I26)","v":""},{"$f":"IF(Teams!A25=\"\",\"\",$E26*Data!$B$2+$G26*Data!$B$3)","v":""},{"$f":"IF(Teams!A25=\"\",\"\",SUMPRODUCT((Fixtures!$E:$E=Calculations!$C26)*(Fixtures!$D:$D>Fixtures!$B:$B)))","v":""},{"$f":"IF(Teams!A25=\"\",\"\",SUMPRODUCT((Fixtures!$E:$E=Calculations!$C26)*(Fixtures!$D:$D<Fixtures!$B:$B)))","v":""},{"$f":"IF(Teams!A25=\"\",\"\",SUMPRODUCT((Fixtures!$E:$E=Calculations!$C26)*(Fixtures!$D:$D=Fixtures!$B:$B)*(Fixtures!$D:$D<>\"\")))","v":""},{"$f":"IF(Teams!A25=\"\",\"\",SUMIFS(Fixtures!$D:$D,Fixtures!$E:$E,Calculations!$C26,Fixtures!$D:$D,\">=0\"))","v":""},{"$f":"IF(Teams!A25=\"\",\"\",SUMIFS(Fixtures!$B:$B,Fixtures!$E:$E,Calculations!$C26,Fixtures!$B:$B,\">=0\"))","v":""},{"$f":"IF(Teams!A25=\"\",\"\",O26-P26)","v":""},{"$f":"IF(Teams!A25=\"\",\"\",$L26*Data!$B$2+$N26*Data!$B$3)","v":""},{"$f":"IF(Teams!A25=\"\",\"\",J26+Q26)","v":""},{"$f":"IF(Teams!A25=\"\",\"\",H26+O26)","v":""},{"$f":"IF(Teams!A25=\"\",\"\",K26+R26)","v":""},{"$f":"IF(Teams!A25=\"\",\"\",RANK(U26,$U$3:$U$22))","v":""},{"$f":"IF(Teams!A25=\"\",\"\",SUMPRODUCT(($U$3:$U$22=U26)*($S$3:$S$22>S26)))","v":""},{"$f":"IF(Teams!A25=\"\",\"\",SUMPRODUCT(($U$3:$U$22=U26)*($S$3:$S$22=S26)*($T$3:$T$22>T26)))","v":""}]
[{"$f":"IF(Teams!A26=\"\",\"\",RANK($B27,$B$3:$B$20,1)+COUNTIF($B$3:$B27,$B27)-1)","v":""},{"$f":"IF(Teams!A26=\"\",\"\",V27+W27+X27)","v":""},{"$f":"IF(Teams!A26=\"\",\"\",Teams!A26)","v":""},{"$f":"IF(Teams!A26=\"\",\"\",COUNTIFS(Fixtures!$A:$A,Calculations!$C27,Fixtures!$B:$B,\">=0\")+COUNTIFS(Fixtures!$E:$E,Calculations!$C27,Fixtures!$D:$D,\">=0\"))","v":""},{"$f":"IF(Teams!A26=\"\",\"\",SUMPRODUCT((Fixtures!$A:$A=Calculations!$C27)*(Fixtures!$B:$B>Fixtures!$D:$D)))","v":""},{"$f":"IF(Teams!A26=\"\",\"\",SUMPRODUCT((Fixtures!$A:$A=Calculations!$C27)*(Fixtures!$B:$B<Fixtures!$D:$D)))","v":""},{"$f":"IF(Teams!A26=\"\",\"\",SUMPRODUCT((Fixtures!$A:$A=Calculations!$C27)*(Fixtures!$B:$B=Fixtures!$D:$D)*(Fixtures!$B:$B<>\"\")))","v":""},{"$f":"IF(Teams!A26=\"\",\"\",SUMIFS(Fixtures!$B:$B,Fixtures!$A:$A,Calculations!$C27,Fixtures!$B:$B,\">=0\"))","v":""},{"$f":"IF(Teams!A26=\"\",\"\",SUMIFS(Fixtures!$D:$D,Fixtures!$A:$A,Calculations!$C27,Fixtures!$D:$D,\">=0\"))","v":""},{"$f":"IF(Teams!A26=\"\",\"\",H27-I27)","v":""},{"$f":"IF(Teams!A26=\"\",\"\",$E27*Data!$B$2+$G27*Data!$B$3)","v":""},{"$f":"IF(Teams!A26=\"\",\"\",SUMPRODUCT((Fixtures!$E:$E=Calculations!$C27)*(Fixtures!$D:$D>Fixtures!$B:$B)))","v":""},{"$f":"IF(Teams!A26=\"\",\"\",SUMPRODUCT((Fixtures!$E:$E=Calculations!$C27)*(Fixtures!$D:$D<Fixtures!$B:$B)))","v":""},{"$f":"IF(Teams!A26=\"\",\"\",SUMPRODUCT((Fixtures!$E:$E=Calculations!$C27)*(Fixtures!$D:$D=Fixtures!$B:$B)*(Fixtures!$D:$D<>\"\")))","v":""},{"$f":"IF(Teams!A26=\"\",\"\",SUMIFS(Fixtures!$D:$D,Fixtures!$E:$E,Calculations!$C27,Fixtures!$D:$D,\">=0\"))","v":""},{"$f":"IF(Teams!A26=\"\",\"\",SUMIFS(Fixtures!$B:$B,Fixtures!$E:$E,Calculations!$C27,Fixtures!$B:$B,\">=0\"))","v":""},{"$f":"IF(Teams!A26=\"\",\"\",O27-P27)","v":""},{"$f":"IF(Teams!A26=\"\",\"\",$L27*Data!$B$2+$N27*Data!$B$3)","v":""},{"$f":"IF(Teams!A26=\"\",\"\",J27+Q27)","v":""},{"$f":"IF(Teams!A26=\"\",\"\",H27+O27)","v":""},{"$f":"IF(Teams!A26=\"\",\"\",K27+R27)","v":""},{"$f":"IF(Teams!A26=\"\",\"\",RANK(U27,$U$3:$U$22))","v":""},{"$f":"IF(Teams!A26=\"\",\"\",SUMPRODUCT(($U$3:$U$22=U27)*($S$3:$S$22>S27)))","v":""},{"$f":"IF(Teams!A26=\"\",\"\",SUMPRODUCT(($U$3:$U$22=U27)*($S$3:$S$22=S27)*($T$3:$T$22>T27)))","v":""}]
[{"$f":"IF(Teams!A27=\"\",\"\",RANK($B28,$B$3:$B$20,1)+COUNTIF($B$3:$B28,$B28)-1)","v":""},{"$f":"IF(Teams!A27=\"\",\"\",V28+W28+X28)","v":""},{"$f":"IF(Teams!A27=\"\",\"\",Teams!A27)","v":""},{"$f":"IF(Teams!A27=\"\",\"\",COUNTIFS(Fixtures!$A:$A,Calculations!$C28,Fixtures!$B:$B,\">=0\")+COUNTIFS(Fixtures!$E:$E,Calculations!$C28,Fixtures!$D:$D,\">=0\"))","v":""},{"$f":"IF(Teams!A27=\"\",\"\",SUMPRODUCT((Fixtures!$A:$A=Calculations!$C28)*(Fixtures!$B:$B>Fixtures!$D:$D)))","v":""},{"$f":"IF(Teams!A27=\"\",\"\",SUMPRODUCT((Fixtures!$A:$A=Calculations!$C28)*(Fixtures!$B:$B<Fixtures!$D:$D)))","v":""},{"$f":"IF(Teams!A27=\"\",\"\",SUMPRODUCT((Fixtures!$A:$A=Calculations!$C28)*(Fixtures!$B:$B=Fixtures!$D:$D)*(Fixtures!$B:$B<>\"\")))","v":""},{"$f":"IF(Teams!A27=\"\",\"\",SUMIFS(Fixtures!$B:$B,Fixtures!$A:$A,Calculations!$C28,Fixtures!$B:$B,\">=0\"))","v":""},{"$f":"IF(Teams!A27=\"\",\"\",SUMIFS(Fixtures!$D:$D,Fixtures!$A:$A,Calculations!$C28,Fixtures!$D:$D,\">=0\"))","v":""},{"$f":"IF(Teams!A27=\"\",\"\",H28-I28)","v":""},{"$f":"IF(Teams!A27=\"\",\"\",$E28*Data!$B$2+$G28*Data!$B$3)","v":""},{"$f":"IF(Teams!A27=\"\",\"\",SUMPRODUCT((Fixtures!$E:$E=Calculations!$C28)*(Fixtures!$D:$D>Fixtures!$B:$B)))","v":""},{"$f":"IF(Teams!A27=\"\",\"\",SUMPRODUCT((Fixtures!$E:$E=Calculations!$C28)*(Fixtures!$D:$D<Fixtures!$B:$B)))","v":""},{"$f":"IF(Teams!A27=\"\",\"\",SUMPRODUCT((Fixtures!$E:$E=Calculations!$C28)*(Fixtures!$D:$D=Fixtures!$B:$B)*(Fixtures!$D:$D<>\"\")))","v":""},{"$f":"IF(Teams!A27=\"\",\"\",SUMIFS(Fixtures!$D:$D,Fixtures!$E:$E,Calculations!$C28,Fixtures!$D:$D,\">=0\"))","v":""},{"$f":"IF(Teams!A27=\"\",\"\",SUMIFS(Fixtures!$B:$B,Fixtures!$E:$E,Calculations!$C28,Fixtures!$B:$B,\">=0\"))","v":""},{"$f":"IF(Teams!A27=\"\",\"\",O28-P28)","v":""},{"$f":"IF(Teams!A27=\"\",\"\",$L28*Data!$B$2+$N28*Data!$B$3)","v":""},{"$f":"IF(Teams!A27=\"\",\"\",J28+Q28)","v":""},{"$f":"IF(Teams!A27=\"\",\"\",H28+O28)","v":""},{"$f":"IF(Teams!A27=\"\",\"\",K28+R28)","v":""},{"$f":"IF(Teams!A27=\"\",\"\",RANK(U28,$U$3:$U$22))","v":""},{"$f":"IF(Teams!A27=\"\",\"\",SUMPRODUCT(($U$3:$U$22=U28)*($S$3:$S$22>S28)))","v":""},{"$f":"IF(Teams!A27=\"\",\"\",SUMPRODUCT(($U$3:$U$22=U28)*($S$3:$S$22=S28)*($T$3:$T$22>T28)))","v":""}]
[{"$f":"IF(Teams!A28=\"\",\"\",RANK($B29,$B$3:$B$20,1)+COUNTIF($B$3:$B29,$B29)-1)","v":""},{"$f":"IF(Teams!A28=\"\",\"\",V29+W29+X29)","v":""},{"$f":"IF(Teams!A28=\"\",\"\",Teams!A28)","v":""},{"$f":"IF(Teams!A28=\"\",\"\",COUNTIFS(Fixtures!$A:$A,Calculations!$C29,Fixtures!$B:$B,\">=0\")+COUNTIFS(Fixtures!$E:$E,Calculations!$C29,Fixtures!$D:$D,\">=0\"))","v":""},{"$f":"IF(Teams!A28=\"\",\"\",SUMPRODUCT((Fixtures!$A:$A=Calculations!$C29)*(Fixtures!$B:$B>Fixtures!$D:$D)))","v":""},{"$f":"IF(Teams!A28=\"\",\"\",SUMPRODUCT((Fixtures!$A:$A=Calculations!$C29)*(Fixtures!$B:$B<Fixtures!$D:$D)))","v":""},{"$f":"IF(Teams!A28=\"\",\"\",SUMPRODUCT((Fixtures!$A:$A=Calculations!$C29)*(Fixtures!$B:$B=Fixtures!$D:$D)*(Fixtures!$B:$B<>\"\")))","v":""},{"$f":"IF(Teams!A28=\"\",\"\",SUMIFS(Fixtures!$B:$B,Fixtures!$A:$A,Calculations!$C29,Fixtures!$B:$B,\">=0\"))","v":""},{"$f":"IF(Teams!A28=\"\",\"\",SUMIFS(Fixtures!$D:$D,Fixtures!$A:$A,Calculations!$C29,Fixtures!$D:$D,\">=0\"))","v":""},{"$f":"IF(Teams!A28=\"\",\"\",H29-I29)","v":""},{"$f":"IF(Teams!A28=\"\",\"\",$E29*Data!$B$2+$G29*Data!$B$3)","v":""},{"$f":"IF(Teams!A28=\"\",\"\",SUMPRODUCT((Fixtures!$E:$E=Calculations!$C29)*(Fixtures!$D:$D>Fixtures!$B:$B)))","v":""},{"$f":"IF(Teams!A28=\"\",\"\",SUMPRODUCT((Fixtures!$E:$E=Calculations!$C29)*(Fixtures!$D:$D<Fixtures!$B:$B)))","v":""},{"$f":"IF(Teams!A28=\"\",\"\",SUMPRODUCT((Fixtures!$E:$E=Calculations!$C29)*(Fixtures!$D:$D=Fixtures!$B:$B)*(Fixtures!$D:$D<>\"\")))","v":""},{"$f":"IF(Teams!A28=\"\",\"\",SUMIFS(Fixtures!$D:$D,Fixtures!$E:$E,Calculations!$C29,Fixtures!$D:$D,\">=0\"))","v":""},{"$f":"IF(Teams!A28=\"\",\"\",SUMIFS(Fixtures!$B:$B,Fixtures!$E:$E,Calculations!$C29,Fixtures!$B:$B,\">=0\"))","v":""},{"$f":"IF(Teams!A28=\"\",\"\",O29-P29)","v":""},{"$f":"IF(Teams!A28=\"\",\"\",$L29*Data!$B$2+$N29*Data!$B$3)","v":""},{"$f":"IF(Teams!A28=\"\",\"\",J29+Q29)","v":""},{"$f":"IF(Teams!A28=\"\",\"\",H29+O29)","v":""},{"$f":"IF(Teams!A28=\"\",\"\",K29+R29)","v":""},{"$f":"IF(Teams!A28=\"\",\"\",RANK(U29,$U$3:$U$22))","v":""},{"$f":"IF(Teams!A28=\"\",\"\",SUMPRODUCT(($U$3:$U$22=U29)*($S$3:$S$22>S29)))","v":""},{"$f":"IF(Teams!A28=\"\",\"\",SUMPRODUCT(($U$3:$U$22=U29)*($S$3:$S$22=S29)*($T$3:$T$22>T29)))","v":""}]
[{"$f":"IF(Teams!A29=\"\",\"\",RANK($B30,$B$3:$B$20,1)+COUNTIF($B$3:$B30,$B30)-1)","v":""},{"$f":"IF(Teams!A29=\"\",\"\",V30+W30+X30)","v":""},{"$f":"IF(Teams!A29=\"\",\"\",Teams!A29)","v":""},{"$f":"IF(Teams!A29=\"\",\"\",COUNTIFS(Fixtures!$A:$A,Calculations!$C30,Fixtures!$B:$B,\">=0\")+COUNTIFS(Fixtures!$E:$E,Calculations!$C30,Fixtures!$D:$D,\">=0\"))","v":""},{"$f":"IF(Teams!A29=\"\",\"\",SUMPRODUCT((Fixtures!$A:$A=Calculations!$C30)*(Fixtures!$B:$B>Fixtures!$D:$D)))","v":""},{"$f":"IF(Teams!A29=\"\",\"\",SUMPRODUCT((Fixtures!$A:$A=Calculations!$C30)*(Fixtures!$B:$B<Fixtures!$D:$D)))","v":""},{"$f":"IF(Teams!A29=\"\",\"\",SUMPRODUCT((Fixtures!$A:$A=Calculations!$C30)*(Fixtures!$B:$B=Fixtures!$D:$D)*(Fixtures!$B:$B<>\"\")))","v":""},{"$f":"IF(Teams!A29=\"\",\"\",SUMIFS(Fixtures!$B:$B,Fixtures!$A:$A,Calculations!$C30,Fixtures!$B:$B,\">=0\"))","v":""},{"$f":"IF(Teams!A29=\"\",\"\",SUMIFS(Fixtures!$D:$D,Fixtures!$A:$A,Calculations!$C30,Fixtures!$D:$D,\">=0\"))","v":""},{"$f":"IF(Teams!A29=\"\",\"\",H30-I30)","v":""},{"$f":"IF(Teams!A29=\"\",\"\",$E30*Data!$B$2+$G30*Data!$B$3)","v":""},{"$f":"IF(Teams!A29=\"\",\"\",SUMPRODUCT((Fixtures!$E:$E=Calculations!$C30)*(Fixtures!$D:$D>Fixtures!$B:$B)))","v":""},{"$f":"IF(Teams!A29=\"\",\"\",SUMPRODUCT((Fixtures!$E:$E=Calculations!$C30)*(Fixtures!$D:$D<Fixtures!$B:$B)))","v":""},{"$f":"IF(Teams!A29=\"\",\"\",SUMPRODUCT((Fixtures!$E:$E=Calculations!$C30)*(Fixtures!$D:$D=Fixtures!$B:$B)*(Fixtures!$D:$D<>\"\")))","v":""},{"$f":"IF(Teams!A29=\"\",\"\",SUMIFS(Fixtures!$D:$D,Fixtures!$E:$E,Calculations!$C30,Fixtures!$D:$D,\">=0\"))","v":""},{"$f":"IF(Teams!A29=\"\",\"\",SUMIFS(Fixtures!$B:$B,Fixtures!$E:$E,Calculations!$C30,Fixtures!$B:$B,\">=0\"))","v":""},{"$f":"IF(Teams!A29=\"\",\"\",O30-P30)","v":""},{"$f":"IF(Teams!A29=\"\",\"\",$L30*Data!$B$2+$N30*Data!$B$3)","v":""},{"$f":"IF(Teams!A29=\"\",\"\",J30+Q30)","v":""},{"$f":"IF(Teams!A29=\"\",\"\",H30+O30)","v":""},{"$f":"IF(Teams!A29=\"\",\"\",K30+R30)","v":""},{"$f":"IF(Teams!A29=\"\",\"\",RANK(U30,$U$3:$U$22))","v":""},{"$f":"IF(Teams!A29=\"\",\"\",SUMPRODUCT(($U$3:$U$22=U30)*($S$3:$S$22>S30)))","v":""},{"$f":"IF(Teams!A29=\"\",\"\",SUMPRODUCT(($U$3:$U$22=U30)*($S$3:$S$22=S30)*($T$3:$T$22>T30)))","v":""}]
[{"$f":"IF(Teams!A30=\"\",\"\",RANK($B31,$B$3:$B$20,1)+COUNTIF($B$3:$B31,$B31)-1)","v":""},{"$f":"IF(Teams!A30=\"\",\"\",V31+W31+X31)","v":""},{"$f":"IF(Teams!A30=\"\",\"\",Teams!A30)","v":""},{"$f":"IF(Teams!A30=\"\",\"\",COUNTIFS(Fixtures!$A:$A,Calculations!$C31,Fixtures!$B:$B,\">=0\")+COUNTIFS(Fixtures!$E:$E,Calculations!$C31,Fixtures!$D:$D,\">=0\"))","v":""},{"$f":"IF(Teams!A30=\"\",\"\",SUMPRODUCT((Fixtures!$A:$A=Calculations!$C31)*(Fixtures!$B:$B>Fixtures!$D:$D)))","v":""},{"$f":"IF(Teams!A30=\"\",\"\",SUMPRODUCT((Fixtures!$A:$A=Calculations!$C31)*(Fixtures!$B:$B<Fixtures!$D:$D)))","v":""},{"$f":"IF(Teams!A30=\"\",\"\",SUMPRODUCT((Fixtures!$A:$A=Calculations!$C31)*(Fixtures!$B:$B=Fixtures!$D:$D)*(Fixtures!$B:$B<>\"\")))","v":""},{"$f":"IF(Teams!A30=\"\",\"\",SUMIFS(Fixtures!$B:$B,Fixtures!$A:$A,Calculations!$C31,Fixtures!$B:$B,\">=0\"))","v":""},{"$f":"IF(Teams!A30=\"\",\"\",SUMIFS(Fixtures!$D:$D,Fixtures!$A:$A,Calculations!$C31,Fixtures!$D:$D,\">=0\"))","v":""},{"$f":"IF(Teams!A30=\"\",\"\",H31-I31)","v":""},{"$f":"IF(Teams!A30=\"\",\"\",$E31*Data!$B$2+$G31*Data!$B$3)","v":""},{"$f":"IF(Teams!A30=\"\",\"\",SUMPRODUCT((Fixtures!$E:$E=Calculations!$C31)*(Fixtures!$D:$D>Fixtures!$B:$B)))","v":""},{"$f":"IF(Teams!A30=\"\",\"\",SUMPRODUCT((Fixtures!$E:$E=Calculations!$C31)*(Fixtures!$D:$D<Fixtures!$B:$B)))","v":""},{"$f":"IF(Teams!A30=\"\",\"\",SUMPRODUCT((Fixtures!$E:$E=Calculations!$C31)*(Fixtures!$D:$D=Fixtures!$B:$B)*(Fixtures!$D:$D<>\"\")))","v":""},{"$f":"IF(Teams!A30=\"\",\"\",SUMIFS(Fixtures!$D:$D,Fixtures!$E:$E,Calculations!$C31,Fixtures!$D:$D,\">=0\"))","v":""},{"$f":"IF(Teams!A30=\"\",\"\",SUMIFS(Fixtures!$B:$B,Fixtures!$E:$E,Calculations!$C31,Fixtures!$B:$B,\">=0\"))","v":""},{"$f":"IF(Teams!A30=\"\",\"\",O31-P31)","v":""},{"$f":"IF(Teams!A30=\"\",\"\",$L31*Data!$B$2+$N31*Data!$B$3)","v":""},{"$f":"IF(Teams!A30=\"\",\"\",J31+Q31)","v":""},{"$f":"IF(Teams!A30=\"\",\"\",H31+O31)","v":""},{"$f":"IF(Teams!A30=\"\",\"\",K31+R31)","v":""},{"$f":"IF(Teams!A30=\"\",\"\",RANK(U31,$U$3:$U$22))","v":""},{"$f":"IF(Teams!A30=\"\",\"\",SUMPRODUCT(($U$3:$U$22=U31)*($S$3:$S$22>S31)))","v":""},{"$f":"IF(Teams!A30=\"\",\"\",SUMPRODUCT(($U$3:$U$22=U31)*($S$3:$S$22=S31)*($T$3:$T$22>T31)))","v":""}]

{"sheet":"League Table","index":5,"n_rows":31,"n_cols":17,"rows_kept":31,"cut":false,"hidden":false,"merged":[[0,3,0,7],[0,8,0,12]]}
[null,null,null,"Home",null,null,null,null,"Away"]
["Position","Team","P","W","L","D","F","A","W","L","D","F","A","GD","Pts"]
[{"$f":"IF(Calculations!$C3=\"\",\"\",ROW($B3)-2)","v":1},{"$f":"IF(Calculations!$C3=\"\",\"\",VLOOKUP(MIN(Calculations!$A$3:$A$31),Calculations!$A$3:$C$31,3,FALSE))","v":"Arsenal"},{"$f":"IF(Calculations!$C3=\"\",\"\",VLOOKUP($B3,Calculations!$C$3:$T$31,2,FALSE))","v":0},{"$f":"IF(Calculations!$C3=\"\",\"\",VLOOKUP($B3,Calculations!$C$3:$T$31,3,FALSE))","v":0},{"$f":"IF(Calculations!$C3=\"\",\"\",VLOOKUP($B3,Calculations!$C$3:$T$31,4,FALSE))","v":0},{"$f":"IF(Calculations!$C3=\"\",\"\",VLOOKUP($B3,Calculations!$C$3:$T$31,5,FALSE))","v":0},{"$f":"IF(Calculations!$C3=\"\",\"\",VLOOKUP($B3,Calculations!$C$3:$T$31,6,FALSE))","v":0},{"$f":"IF(Calculations!$C3=\"\",\"\",VLOOKUP($B3,Calculations!$C$3:$T$31,7,FALSE))","v":0},{"$f":"IF(Calculations!$C3=\"\",\"\",VLOOKUP($B3,Calculations!$C$3:$T$31,10,FALSE))","v":0},{"$f":"IF(Calculations!$C3=\"\",\"\",VLOOKUP($B3,Calculations!$C$3:$T$31,11,FALSE))","v":0},{"$f":"IF(Calculations!$C3=\"\",\"\",VLOOKUP($B3,Calculations!$C$3:$T$31,12,FALSE))","v":0},{"$f":"IF(Calculations!$C3=\"\",\"\",VLOOKUP($B3,Calculations!$C$3:$T$31,13,FALSE))","v":0},{"$f":"IF(Calculations!$C3=\"\",\"\",VLOOKUP($B3,Calculations!$C$3:$T$31,14,FALSE))","v":0},{"$f":"IF(Calculations!$C3=\"\",\"\",VLOOKUP($B3,Calculations!$C$3:$T$31,17,FALSE))","v":0},{"$f":"IF(Calculations!$C3=\"\",\"\",VLOOKUP($B3,Calculations!$C$3:$U$31,19,FALSE))","v":0},null,"Created by"]
[{"$f":"IF(Calculations!$C4=\"\",\"\",ROW($B4)-2)","v":2},{"$f":"IF(Calculations!$C4=\"\",\"\",VLOOKUP(SMALL(Calculations!$A$3:$A$31,A4),Calculations!$A$3:$C$31,3,FALSE))","v":"Aston Villa"},{"$f":"IF(Calculations!$C4=\"\",\"\",VLOOKUP($B4,Calculations!$C$3:$T$31,2,FALSE))","v":0},{"$f":"IF(Calculations!$C4=\"\",\"\",VLOOKUP($B4,Calculations!$C$3:$T$31,3,FALSE))","v":0},{"$f":"IF(Calculations!$C4=\"\",\"\",VLOOKUP($B4,Calculations!$C$3:$T$31,4,FALSE))","v":0},{"$f":"IF(Calculations!$C4=\"\",\"\",VLOOKUP($B4,Calculations!$C$3:$T$31,5,FALSE))","v":0},{"$f":"IF(Calculations!$C4=\"\",\"\",VLOOKUP($B4,Calculations!$C$3:$T$31,6,FALSE))","v":0},{"$f":"IF(Calculations!$C4=\"\",\"\",VLOOKUP($B4,Calculations!$C$3:$T$31,7,FALSE))","v":0},{"$f":"IF(Calculations!$C4=\"\",\"\",VLOOKUP($B4,Calculations!$C$3:$T$31,10,FALSE))","v":0},{"$f":"IF(Calculations!$C4=\"\",\"\",VLOOKUP($B4,Calculations!$C$3:$T$31,11,FALSE))","v":0},{"$f":"IF(Calculations!$C4=\"\",\"\",VLOOKUP($B4,Calculations!$C$3:$T$31,12,FALSE))","v":0},{"$f":"IF(Calculations!$C4=\"\",\"\",VLOOKUP($B4,Calculations!$C$3:$T$31,13,FALSE))","v":0},{"$f":"IF(Calculations!$C4=\"\",\"\",VLOOKUP($B4,Calculations!$C$3:$T$31,14,FALSE))","v":0},{"$f":"IF(Calculations!$C4=\"\",\"\",VLOOKUP($B4,Calculations!$C$3:$T$31,17,FALSE))","v":0},{"$f":"IF(Calculations!$C4=\"\",\"\",VLOOKUP($B4,Calculations!$C$3:$U$31,19,FALSE))","v":0},null,"www.computergaga.com"]
[{"$f":"IF(Calculations!$C5=\"\",\"\",ROW($B5)-2)","v":3},{"$f":"IF(Calculations!$C5=\"\",\"\",VLOOKUP(SMALL(Calculations!$A$3:$A$31,A5),Calculations!$A$3:$C$31,3,FALSE))","v":"Blackburn Rovers"},{"$f":"IF(Calculations!$C5=\"\",\"\",VLOOKUP($B5,Calculations!$C$3:$T$31,2,FALSE))","v":0},{"$f":"IF(Calculations!$C5=\"\",\"\",VLOOKUP($B5,Calculations!$C$3:$T$31,3,FALSE))","v":0},{"$f":"IF(Calculations!$C5=\"\",\"\",VLOOKUP($B5,Calculations!$C$3:$T$31,4,FALSE))","v":0},{"$f":"IF(Calculations!$C5=\"\",\"\",VLOOKUP($B5,Calculations!$C$3:$T$31,5,FALSE))","v":0},{"$f":"IF(Calculations!$C5=\"\",\"\",VLOOKUP($B5,Calculations!$C$3:$T$31,6,FALSE))","v":0},{"$f":"IF(Calculations!$C5=\"\",\"\",VLOOKUP($B5,Calculations!$C$3:$T$31,7,FALSE))","v":0},{"$f":"IF(Calculations!$C5=\"\",\"\",VLOOKUP($B5,Calculations!$C$3:$T$31,10,FALSE))","v":0},{"$f":"IF(Calculations!$C5=\"\",\"\",VLOOKUP($B5,Calculations!$C$3:$T$31,11,FALSE))","v":0},{"$f":"IF(Calculations!$C5=\"\",\"\",VLOOKUP($B5,Calculations!$C$3:$T$31,12,FALSE))","v":0},{"$f":"IF(Calculations!$C5=\"\",\"\",VLOOKUP($B5,Calculations!$C$3:$T$31,13,FALSE))","v":0},{"$f":"IF(Calculations!$C5=\"\",\"\",VLOOKUP($B5,Calculations!$C$3:$T$31,14,FALSE))","v":0},{"$f":"IF(Calculations!$C5=\"\",\"\",VLOOKUP($B5,Calculations!$C$3:$T$31,17,FALSE))","v":0},{"$f":"IF(Calculations!$C5=\"\",\"\",VLOOKUP($B5,Calculations!$C$3:$U$31,19,FALSE))","v":0}]
[{"$f":"IF(Calculations!$C6=\"\",\"\",ROW($B6)-2)","v":4},{"$f":"IF(Calculations!$C6=\"\",\"\",VLOOKUP(SMALL(Calculations!$A$3:$A$31,A6),Calculations!$A$3:$C$31,3,FALSE))","v":"Bolton Wanderers"},{"$f":"IF(Calculations!$C6=\"\",\"\",VLOOKUP($B6,Calculations!$C$3:$T$31,2,FALSE))","v":0},{"$f":"IF(Calculations!$C6=\"\",\"\",VLOOKUP($B6,Calculations!$C$3:$T$31,3,FALSE))","v":0},{"$f":"IF(Calculations!$C6=\"\",\"\",VLOOKUP($B6,Calculations!$C$3:$T$31,4,FALSE))","v":0},{"$f":"IF(Calculations!$C6=\"\",\"\",VLOOKUP($B6,Calculations!$C$3:$T$31,5,FALSE))","v":0},{"$f":"IF(Calculations!$C6=\"\",\"\",VLOOKUP($B6,Calculations!$C$3:$T$31,6,FALSE))","v":0},{"$f":"IF(Calculations!$C6=\"\",\"\",VLOOKUP($B6,Calculations!$C$3:$T$31,7,FALSE))","v":0},{"$f":"IF(Calculations!$C6=\"\",\"\",VLOOKUP($B6,Calculations!$C$3:$T$31,10,FALSE))","v":0},{"$f":"IF(Calculations!$C6=\"\",\"\",VLOOKUP($B6,Calculations!$C$3:$T$31,11,FALSE))","v":0},{"$f":"IF(Calculations!$C6=\"\",\"\",VLOOKUP($B6,Calculations!$C$3:$T$31,12,FALSE))","v":0},{"$f":"IF(Calculations!$C6=\"\",\"\",VLOOKUP($B6,Calculations!$C$3:$T$31,13,FALSE))","v":0},{"$f":"IF(Calculations!$C6=\"\",\"\",VLOOKUP($B6,Calculations!$C$3:$T$31,14,FALSE))","v":0},{"$f":"IF(Calculations!$C6=\"\",\"\",VLOOKUP($B6,Calculations!$C$3:$T$31,17,FALSE))","v":0},{"$f":"IF(Calculations!$C6=\"\",\"\",VLOOKUP($B6,Calculations!$C$3:$U$31,19,FALSE))","v":0}]
[{"$f":"IF(Calculations!$C7=\"\",\"\",ROW($B7)-2)","v":5},{"$f":"IF(Calculations!$C7=\"\",\"\",VLOOKUP(SMALL(Calculations!$A$3:$A$31,A7),Calculations!$A$3:$C$31,3,FALSE))","v":"Chelsea"},{"$f":"IF(Calculations!$C7=\"\",\"\",VLOOKUP($B7,Calculations!$C$3:$T$31,2,FALSE))","v":0},{"$f":"IF(Calculations!$C7=\"\",\"\",VLOOKUP($B7,Calculations!$C$3:$T$31,3,FALSE))","v":0},{"$f":"IF(Calculations!$C7=\"\",\"\",VLOOKUP($B7,Calculations!$C$3:$T$31,4,FALSE))","v":0},{"$f":"IF(Calculations!$C7=\"\",\"\",VLOOKUP($B7,Calculations!$C$3:$T$31,5,FALSE))","v":0},{"$f":"IF(Calculations!$C7=\"\",\"\",VLOOKUP($B7,Calculations!$C$3:$T$31,6,FALSE))","v":0},{"$f":"IF(Calculations!$C7=\"\",\"\",VLOOKUP($B7,Calculations!$C$3:$T$31,7,FALSE))","v":0},{"$f":"IF(Calculations!$C7=\"\",\"\",VLOOKUP($B7,Calculations!$C$3:$T$31,10,FALSE))","v":0},{"$f":"IF(Calculations!$C7=\"\",\"\",VLOOKUP($B7,Calculations!$C$3:$T$31,11,FALSE))","v":0},{"$f":"IF(Calculations!$C7=\"\",\"\",VLOOKUP($B7,Calculations!$C$3:$T$31,12,FALSE))","v":0},{"$f":"IF(Calculations!$C7=\"\",\"\",VLOOKUP($B7,Calculations!$C$3:$T$31,13,FALSE))","v":0},{"$f":"IF(Calculations!$C7=\"\",\"\",VLOOKUP($B7,Calculations!$C$3:$T$31,14,FALSE))","v":0},{"$f":"IF(Calculations!$C7=\"\",\"\",VLOOKUP($B7,Calculations!$C$3:$T$31,17,FALSE))","v":0},{"$f":"IF(Calculations!$C7=\"\",\"\",VLOOKUP($B7,Calculations!$C$3:$U$31,19,FALSE))","v":0}]
[{"$f":"IF(Calculations!$C8=\"\",\"\",ROW($B8)-2)","v":6},{"$f":"IF(Calculations!$C8=\"\",\"\",VLOOKUP(SMALL(Calculations!$A$3:$A$31,A8),Calculations!$A$3:$C$31,3,FALSE))","v":"Everton"},{"$f":"IF(Calculations!$C8=\"\",\"\",VLOOKUP($B8,Calculations!$C$3:$T$31,2,FALSE))","v":0},{"$f":"IF(Calculations!$C8=\"\",\"\",VLOOKUP($B8,Calculations!$C$3:$T$31,3,FALSE))","v":0},{"$f":"IF(Calculations!$C8=\"\",\"\",VLOOKUP($B8,Calculations!$C$3:$T$31,4,FALSE))","v":0},{"$f":"IF(Calculations!$C8=\"\",\"\",VLOOKUP($B8,Calculations!$C$3:$T$31,5,FALSE))","v":0},{"$f":"IF(Calculations!$C8=\"\",\"\",VLOOKUP($B8,Calculations!$C$3:$T$31,6,FALSE))","v":0},{"$f":"IF(Calculations!$C8=\"\",\"\",VLOOKUP($B8,Calculations!$C$3:$T$31,7,FALSE))","v":0},{"$f":"IF(Calculations!$C8=\"\",\"\",VLOOKUP($B8,Calculations!$C$3:$T$31,10,FALSE))","v":0},{"$f":"IF(Calculations!$C8=\"\",\"\",VLOOKUP($B8,Calculations!$C$3:$T$31,11,FALSE))","v":0},{"$f":"IF(Calculations!$C8=\"\",\"\",VLOOKUP($B8,Calculations!$C$3:$T$31,12,FALSE))","v":0},{"$f":"IF(Calculations!$C8=\"\",\"\",VLOOKUP($B8,Calculations!$C$3:$T$31,13,FALSE))","v":0},{"$f":"IF(Calculations!$C8=\"\",\"\",VLOOKUP($B8,Calculations!$C$3:$T$31,14,FALSE))","v":0},{"$f":"IF(Calculations!$C8=\"\",\"\",VLOOKUP($B8,Calculations!$C$3:$T$31,17,FALSE))","v":0},{"$f":"IF(Calculations!$C8=\"\",\"\",VLOOKUP($B8,Calculations!$C$3:$U$31,19,FALSE))","v":0}]
[{"$f":"IF(Calculations!$C9=\"\",\"\",ROW($B9)-2)","v":7},{"$f":"IF(Calculations!$C9=\"\",\"\",VLOOKUP(SMALL(Calculations!$A$3:$A$31,A9),Calculations!$A$3:$C$31,3,FALSE))","v":"Fulham"},{"$f":"IF(Calculations!$C9=\"\",\"\",VLOOKUP($B9,Calculations!$C$3:$T$31,2,FALSE))","v":0},{"$f":"IF(Calculations!$C9=\"\",\"\",VLOOKUP($B9,Calculations!$C$3:$T$31,3,FALSE))","v":0},{"$f":"IF(Calculations!$C9=\"\",\"\",VLOOKUP($B9,Calculations!$C$3:$T$31,4,FALSE))","v":0},{"$f":"IF(Calculations!$C9=\"\",\"\",VLOOKUP($B9,Calculations!$C$3:$T$31,5,FALSE))","v":0},{"$f":"IF(Calculations!$C9=\"\",\"\",VLOOKUP($B9,Calculations!$C$3:$T$31,6,FALSE))","v":0},{"$f":"IF(Calculations!$C9=\"\",\"\",VLOOKUP($B9,Calculations!$C$3:$T$31,7,FALSE))","v":0},{"$f":"IF(Calculations!$C9=\"\",\"\",VLOOKUP($B9,Calculations!$C$3:$T$31,10,FALSE))","v":0},{"$f":"IF(Calculations!$C9=\"\",\"\",VLOOKUP($B9,Calculations!$C$3:$T$31,11,FALSE))","v":0},{"$f":"IF(Calculations!$C9=\"\",\"\",VLOOKUP($B9,Calculations!$C$3:$T$31,12,FALSE))","v":0},{"$f":"IF(Calculations!$C9=\"\",\"\",VLOOKUP($B9,Calculations!$C$3:$T$31,13,FALSE))","v":0},{"$f":"IF(Calculations!$C9=\"\",\"\",VLOOKUP($B9,Calculations!$C$3:$T$31,14,FALSE))","v":0},{"$f":"IF(Calculations!$C9=\"\",\"\",VLOOKUP($B9,Calculations!$C$3:$T$31,17,FALSE))","v":0},{"$f":"IF(Calculations!$C9=\"\",\"\",VLOOKUP($B9,Calculations!$C$3:$U$31,19,FALSE))","v":0}]
[{"$f":"IF(Calculations!$C10=\"\",\"\",ROW($B10)-2)","v":8},{"$f":"IF(Calculations!$C10=\"\",\"\",VLOOKUP(SMALL(Calculations!$A$3:$A$31,A10),Calculations!$A$3:$C$31,3,FALSE))","v":"Liverpool"},{"$f":"IF(Calculations!$C10=\"\",\"\",VLOOKUP($B10,Calculations!$C$3:$T$31,2,FALSE))","v":0},{"$f":"IF(Calculations!$C10=\"\",\"\",VLOOKUP($B10,Calculations!$C$3:$T$31,3,FALSE))","v":0},{"$f":"IF(Calculations!$C10=\"\",\"\",VLOOKUP($B10,Calculations!$C$3:$T$31,4,FALSE))","v":0},{"$f":"IF(Calculations!$C10=\"\",\"\",VLOOKUP($B10,Calculations!$C$3:$T$31,5,FALSE))","v":0},{"$f":"IF(Calculations!$C10=\"\",\"\",VLOOKUP($B10,Calculations!$C$3:$T$31,6,FALSE))","v":0},{"$f":"IF(Calculations!$C10=\"\",\"\",VLOOKUP($B10,Calculations!$C$3:$T$31,7,FALSE))","v":0},{"$f":"IF(Calculations!$C10=\"\",\"\",VLOOKUP($B10,Calculations!$C$3:$T$31,10,FALSE))","v":0},{"$f":"IF(Calculations!$C10=\"\",\"\",VLOOKUP($B10,Calculations!$C$3:$T$31,11,FALSE))","v":0},{"$f":"IF(Calculations!$C10=\"\",\"\",VLOOKUP($B10,Calculations!$C$3:$T$31,12,FALSE))","v":0},{"$f":"IF(Calculations!$C10=\"\",\"\",VLOOKUP($B10,Calculations!$C$3:$T$31,13,FALSE))","v":0},{"$f":"IF(Calculations!$C10=\"\",\"\",VLOOKUP($B10,Calculations!$C$3:$T$31,14,FALSE))","v":0},{"$f":"IF(Calculations!$C10=\"\",\"\",VLOOKUP($B10,Calculations!$C$3:$T$31,17,FALSE))","v":0},{"$f":"IF(Calculations!$C10=\"\",\"\",VLOOKUP($B10,Calculations!$C$3:$U$31,19,FALSE))","v":0}]
[{"$f":"IF(Calculations!$C11=\"\",\"\",ROW($B11)-2)","v":9},{"$f":"IF(Calculations!$C11=\"\",\"\",VLOOKUP(SMALL(Calculations!$A$3:$A$31,A11),Calculations!$A$3:$C$31,3,FALSE))","v":"Manchester City"},{"$f":"IF(Calculations!$C11=\"\",\"\",VLOOKUP($B11,Calculations!$C$3:$T$31,2,FALSE))","v":0},{"$f":"IF(Calculations!$C11=\"\",\"\",VLOOKUP($B11,Calculations!$C$3:$T$31,3,FALSE))","v":0},{"$f":"IF(Calculations!$C11=\"\",\"\",VLOOKUP($B11,Calculations!$C$3:$T$31,4,FALSE))","v":0},{"$f":"IF(Calculations!$C11=\"\",\"\",VLOOKUP($B11,Calculations!$C$3:$T$31,5,FALSE))","v":0},{"$f":"IF(Calculations!$C11=\"\",\"\",VLOOKUP($B11,Calculations!$C$3:$T$31,6,FALSE))","v":0},{"$f":"IF(Calculations!$C11=\"\",\"\",VLOOKUP($B11,Calculations!$C$3:$T$31,7,FALSE))","v":0},{"$f":"IF(Calculations!$C11=\"\",\"\",VLOOKUP($B11,Calculations!$C$3:$T$31,10,FALSE))","v":0},{"$f":"IF(Calculations!$C11=\"\",\"\",VLOOKUP($B11,Calculations!$C$3:$T$31,11,FALSE))","v":0},{"$f":"IF(Calculations!$C11=\"\",\"\",VLOOKUP($B11,Calculations!$C$3:$T$31,12,FALSE))","v":0},{"$f":"IF(Calculations!$C11=\"\",\"\",VLOOKUP($B11,Calculations!$C$3:$T$31,13,FALSE))","v":0},{"$f":"IF(Calculations!$C11=\"\",\"\",VLOOKUP($B11,Calculations!$C$3:$T$31,14,FALSE))","v":0},{"$f":"IF(Calculations!$C11=\"\",\"\",VLOOKUP($B11,Calculations!$C$3:$T$31,17,FALSE))","v":0},{"$f":"IF(Calculations!$C11=\"\",\"\",VLOOKUP($B11,Calculations!$C$3:$U$31,19,FALSE))","v":0}]
[{"$f":"IF(Calculations!$C12=\"\",\"\",ROW($B12)-2)","v":10},{"$f":"IF(Calculations!$C12=\"\",\"\",VLOOKUP(SMALL(Calculations!$A$3:$A$31,A12),Calculations!$A$3:$C$31,3,FALSE))","v":"Manchester United"},{"$f":"IF(Calculations!$C12=\"\",\"\",VLOOKUP($B12,Calculations!$C$3:$T$31,2,FALSE))","v":0},{"$f":"IF(Calculations!$C12=\"\",\"\",VLOOKUP($B12,Calculations!$C$3:$T$31,3,FALSE))","v":0},{"$f":"IF(Calculations!$C12=\"\",\"\",VLOOKUP($B12,Calculations!$C$3:$T$31,4,FALSE))","v":0},{"$f":"IF(Calculations!$C12=\"\",\"\",VLOOKUP($B12,Calculations!$C$3:$T$31,5,FALSE))","v":0},{"$f":"IF(Calculations!$C12=\"\",\"\",VLOOKUP($B12,Calculations!$C$3:$T$31,6,FALSE))","v":0},{"$f":"IF(Calculations!$C12=\"\",\"\",VLOOKUP($B12,Calculations!$C$3:$T$31,7,FALSE))","v":0},{"$f":"IF(Calculations!$C12=\"\",\"\",VLOOKUP($B12,Calculations!$C$3:$T$31,10,FALSE))","v":0},{"$f":"IF(Calculations!$C12=\"\",\"\",VLOOKUP($B12,Calculations!$C$3:$T$31,11,FALSE))","v":0},{"$f":"IF(Calculations!$C12=\"\",\"\",VLOOKUP($B12,Calculations!$C$3:$T$31,12,FALSE))","v":0},{"$f":"IF(Calculations!$C12=\"\",\"\",VLOOKUP($B12,Calculations!$C$3:$T$31,13,FALSE))","v":0},{"$f":"IF(Calculations!$C12=\"\",\"\",VLOOKUP($B12,Calculations!$C$3:$T$31,14,FALSE))","v":0},{"$f":"IF(Calculations!$C12=\"\",\"\",VLOOKUP($B12,Calculations!$C$3:$T$31,17,FALSE))","v":0},{"$f":"IF(Calculations!$C12=\"\",\"\",VLOOKUP($B12,Calculations!$C$3:$U$31,19,FALSE))","v":0}]
[{"$f":"IF(Calculations!$C13=\"\",\"\",ROW($B13)-2)","v":11},{"$f":"IF(Calculations!$C13=\"\",\"\",VLOOKUP(SMALL(Calculations!$A$3:$A$31,A13),Calculations!$A$3:$C$31,3,FALSE))","v":"Newcastle United"},{"$f":"IF(Calculations!$C13=\"\",\"\",VLOOKUP($B13,Calculations!$C$3:$T$31,2,FALSE))","v":0},{"$f":"IF(Calculations!$C13=\"\",\"\",VLOOKUP($B13,Calculations!$C$3:$T$31,3,FALSE))","v":0},{"$f":"IF(Calculations!$C13=\"\",\"\",VLOOKUP($B13,Calculations!$C$3:$T$31,4,FALSE))","v":0},{"$f":"IF(Calculations!$C13=\"\",\"\",VLOOKUP($B13,Calculations!$C$3:$T$31,5,FALSE))","v":0},{"$f":"IF(Calculations!$C13=\"\",\"\",VLOOKUP($B13,Calculations!$C$3:$T$31,6,FALSE))","v":0},{"$f":"IF(Calculations!$C13=\"\",\"\",VLOOKUP($B13,Calculations!$C$3:$T$31,7,FALSE))","v":0},{"$f":"IF(Calculations!$C13=\"\",\"\",VLOOKUP($B13,Calculations!$C$3:$T$31,10,FALSE))","v":0},{"$f":"IF(Calculations!$C13=\"\",\"\",VLOOKUP($B13,Calculations!$C$3:$T$31,11,FALSE))","v":0},{"$f":"IF(Calculations!$C13=\"\",\"\",VLOOKUP($B13,Calculations!$C$3:$T$31,12,FALSE))","v":0},{"$f":"IF(Calculations!$C13=\"\",\"\",VLOOKUP($B13,Calculations!$C$3:$T$31,13,FALSE))","v":0},{"$f":"IF(Calculations!$C13=\"\",\"\",VLOOKUP($B13,Calculations!$C$3:$T$31,14,FALSE))","v":0},{"$f":"IF(Calculations!$C13=\"\",\"\",VLOOKUP($B13,Calculations!$C$3:$T$31,17,FALSE))","v":0},{"$f":"IF(Calculations!$C13=\"\",\"\",VLOOKUP($B13,Calculations!$C$3:$U$31,19,FALSE))","v":0}]
[{"$f":"IF(Calculations!$C14=\"\",\"\",ROW($B14)-2)","v":12},{"$f":"IF(Calculations!$C14=\"\",\"\",VLOOKUP(SMALL(Calculations!$A$3:$A$31,A14),Calculations!$A$3:$C$31,3,FALSE))","v":"Norwich"},{"$f":"IF(Calculations!$C14=\"\",\"\",VLOOKUP($B14,Calculations!$C$3:$T$31,2,FALSE))","v":0},{"$f":"IF(Calculations!$C14=\"\",\"\",VLOOKUP($B14,Calculations!$C$3:$T$31,3,FALSE))","v":0},{"$f":"IF(Calculations!$C14=\"\",\"\",VLOOKUP($B14,Calculations!$C$3:$T$31,4,FALSE))","v":0},{"$f":"IF(Calculations!$C14=\"\",\"\",VLOOKUP($B14,Calculations!$C$3:$T$31,5,FALSE))","v":0},{"$f":"IF(Calculations!$C14=\"\",\"\",VLOOKUP($B14,Calculations!$C$3:$T$31,6,FALSE))","v":0},{"$f":"IF(Calculations!$C14=\"\",\"\",VLOOKUP($B14,Calculations!$C$3:$T$31,7,FALSE))","v":0},{"$f":"IF(Calculations!$C14=\"\",\"\",VLOOKUP($B14,Calculations!$C$3:$T$31,10,FALSE))","v":0},{"$f":"IF(Calculations!$C14=\"\",\"\",VLOOKUP($B14,Calculations!$C$3:$T$31,11,FALSE))","v":0},{"$f":"IF(Calculations!$C14=\"\",\"\",VLOOKUP($B14,Calculations!$C$3:$T$31,12,FALSE))","v":0},{"$f":"IF(Calculations!$C14=\"\",\"\",VLOOKUP($B14,Calculations!$C$3:$T$31,13,FALSE))","v":0},{"$f":"IF(Calculations!$C14=\"\",\"\",VLOOKUP($B14,Calculations!$C$3:$T$31,14,FALSE))","v":0},{"$f":"IF(Calculations!$C14=\"\",\"\",VLOOKUP($B14,Calculations!$C$3:$T$31,17,FALSE))","v":0},{"$f":"IF(Calculations!$C14=\"\",\"\",VLOOKUP($B14,Calculations!$C$3:$U$31,19,FALSE))","v":0}]
[{"$f":"IF(Calculations!$C15=\"\",\"\",ROW($B15)-2)","v":13},{"$f":"IF(Calculations!$C15=\"\",\"\",VLOOKUP(SMALL(Calculations!$A$3:$A$31,A15),Calculations!$A$3:$C$31,3,FALSE))","v":"Queens Park Rangers"},{"$f":"IF(Calculations!$C15=\"\",\"\",VLOOKUP($B15,Calculations!$C$3:$T$31,2,FALSE))","v":0},{"$f":"IF(Calculations!$C15=\"\",\"\",VLOOKUP($B15,Calculations!$C$3:$T$31,3,FALSE))","v":0},{"$f":"IF(Calculations!$C15=\"\",\"\",VLOOKUP($B15,Calculations!$C$3:$T$31,4,FALSE))","v":0},{"$f":"IF(Calculations!$C15=\"\",\"\",VLOOKUP($B15,Calculations!$C$3:$T$31,5,FALSE))","v":0},{"$f":"IF(Calculations!$C15=\"\",\"\",VLOOKUP($B15,Calculations!$C$3:$T$31,6,FALSE))","v":0},{"$f":"IF(Calculations!$C15=\"\",\"\",VLOOKUP($B15,Calculations!$C$3:$T$31,7,FALSE))","v":0},{"$f":"IF(Calculations!$C15=\"\",\"\",VLOOKUP($B15,Calculations!$C$3:$T$31,10,FALSE))","v":0},{"$f":"IF(Calculations!$C15=\"\",\"\",VLOOKUP($B15,Calculations!$C$3:$T$31,11,FALSE))","v":0},{"$f":"IF(Calculations!$C15=\"\",\"\",VLOOKUP($B15,Calculations!$C$3:$T$31,12,FALSE))","v":0},{"$f":"IF(Calculations!$C15=\"\",\"\",VLOOKUP($B15,Calculations!$C$3:$T$31,13,FALSE))","v":0},{"$f":"IF(Calculations!$C15=\"\",\"\",VLOOKUP($B15,Calculations!$C$3:$T$31,14,FALSE))","v":0},{"$f":"IF(Calculations!$C15=\"\",\"\",VLOOKUP($B15,Calculations!$C$3:$T$31,17,FALSE))","v":0},{"$f":"IF(Calculations!$C15=\"\",\"\",VLOOKUP($B15,Calculations!$C$3:$U$31,19,FALSE))","v":0}]
[{"$f":"IF(Calculations!$C16=\"\",\"\",ROW($B16)-2)","v":14},{"$f":"IF(Calculations!$C16=\"\",\"\",VLOOKUP(SMALL(Calculations!$A$3:$A$31,A16),Calculations!$A$3:$C$31,3,FALSE))","v":"Stoke City"},{"$f":"IF(Calculations!$C16=\"\",\"\",VLOOKUP($B16,Calculations!$C$3:$T$31,2,FALSE))","v":0},{"$f":"IF(Calculations!$C16=\"\",\"\",VLOOKUP($B16,Calculations!$C$3:$T$31,3,FALSE))","v":0},{"$f":"IF(Calculations!$C16=\"\",\"\",VLOOKUP($B16,Calculations!$C$3:$T$31,4,FALSE))","v":0},{"$f":"IF(Calculations!$C16=\"\",\"\",VLOOKUP($B16,Calculations!$C$3:$T$31,5,FALSE))","v":0},{"$f":"IF(Calculations!$C16=\"\",\"\",VLOOKUP($B16,Calculations!$C$3:$T$31,6,FALSE))","v":0},{"$f":"IF(Calculations!$C16=\"\",\"\",VLOOKUP($B16,Calculations!$C$3:$T$31,7,FALSE))","v":0},{"$f":"IF(Calculations!$C16=\"\",\"\",VLOOKUP($B16,Calculations!$C$3:$T$31,10,FALSE))","v":0},{"$f":"IF(Calculations!$C16=\"\",\"\",VLOOKUP($B16,Calculations!$C$3:$T$31,11,FALSE))","v":0},{"$f":"IF(Calculations!$C16=\"\",\"\",VLOOKUP($B16,Calculations!$C$3:$T$31,12,FALSE))","v":0},{"$f":"IF(Calculations!$C16=\"\",\"\",VLOOKUP($B16,Calculations!$C$3:$T$31,13,FALSE))","v":0},{"$f":"IF(Calculations!$C16=\"\",\"\",VLOOKUP($B16,Calculations!$C$3:$T$31,14,FALSE))","v":0},{"$f":"IF(Calculations!$C16=\"\",\"\",VLOOKUP($B16,Calculations!$C$3:$T$31,17,FALSE))","v":0},{"$f":"IF(Calculations!$C16=\"\",\"\",VLOOKUP($B16,Calculations!$C$3:$U$31,19,FALSE))","v":0}]
[{"$f":"IF(Calculations!$C17=\"\",\"\",ROW($B17)-2)","v":15},{"$f":"IF(Calculations!$C17=\"\",\"\",VLOOKUP(SMALL(Calculations!$A$3:$A$31,A17),Calculations!$A$3:$C$31,3,FALSE))","v":"Sunderland"},{"$f":"IF(Calculations!$C17=\"\",\"\",VLOOKUP($B17,Calculations!$C$3:$T$31,2,FALSE))","v":0},{"$f":"IF(Calculations!$C17=\"\",\"\",VLOOKUP($B17,Calculations!$C$3:$T$31,3,FALSE))","v":0},{"$f":"IF(Calculations!$C17=\"\",\"\",VLOOKUP($B17,Calculations!$C$3:$T$31,4,FALSE))","v":0},{"$f":"IF(Calculations!$C17=\"\",\"\",VLOOKUP($B17,Calculations!$C$3:$T$31,5,FALSE))","v":0},{"$f":"IF(Calculations!$C17=\"\",\"\",VLOOKUP($B17,Calculations!$C$3:$T$31,6,FALSE))","v":0},{"$f":"IF(Calculations!$C17=\"\",\"\",VLOOKUP($B17,Calculations!$C$3:$T$31,7,FALSE))","v":0},{"$f":"IF(Calculations!$C17=\"\",\"\",VLOOKUP($B17,Calculations!$C$3:$T$31,10,FALSE))","v":0},{"$f":"IF(Calculations!$C17=\"\",\"\",VLOOKUP($B17,Calculations!$C$3:$T$31,11,FALSE))","v":0},{"$f":"IF(Calculations!$C17=\"\",\"\",VLOOKUP($B17,Calculations!$C$3:$T$31,12,FALSE))","v":0},{"$f":"IF(Calculations!$C17=\"\",\"\",VLOOKUP($B17,Calculations!$C$3:$T$31,13,FALSE))","v":0},{"$f":"IF(Calculations!$C17=\"\",\"\",VLOOKUP($B17,Calculations!$C$3:$T$31,14,FALSE))","v":0},{"$f":"IF(Calculations!$C17=\"\",\"\",VLOOKUP($B17,Calculations!$C$3:$T$31,17,FALSE))","v":0},{"$f":"IF(Calculations!$C17=\"\",\"\",VLOOKUP($B17,Calculations!$C$3:$U$31,19,FALSE))","v":0}]
[{"$f":"IF(Calculations!$C18=\"\",\"\",ROW($B18)-2)","v":16},{"$f":"IF(Calculations!$C18=\"\",\"\",VLOOKUP(SMALL(Calculations!$A$3:$A$31,A18),Calculations!$A$3:$C$31,3,FALSE))","v":"Swansea City"},{"$f":"IF(Calculations!$C18=\"\",\"\",VLOOKUP($B18,Calculations!$C$3:$T$31,2,FALSE))","v":0},{"$f":"IF(Calculations!$C18=\"\",\"\",VLOOKUP($B18,Calculations!$C$3:$T$31,3,FALSE))","v":0},{"$f":"IF(Calculations!$C18=\"\",\"\",VLOOKUP($B18,Calculations!$C$3:$T$31,4,FALSE))","v":0},{"$f":"IF(Calculations!$C18=\"\",\"\",VLOOKUP($B18,Calculations!$C$3:$T$31,5,FALSE))","v":0},{"$f":"IF(Calculations!$C18=\"\",\"\",VLOOKUP($B18,Calculations!$C$3:$T$31,6,FALSE))","v":0},{"$f":"IF(Calculations!$C18=\"\",\"\",VLOOKUP($B18,Calculations!$C$3:$T$31,7,FALSE))","v":0},{"$f":"IF(Calculations!$C18=\"\",\"\",VLOOKUP($B18,Calculations!$C$3:$T$31,10,FALSE))","v":0},{"$f":"IF(Calculations!$C18=\"\",\"\",VLOOKUP($B18,Calculations!$C$3:$T$31,11,FALSE))","v":0},{"$f":"IF(Calculations!$C18=\"\",\"\",VLOOKUP($B18,Calculations!$C$3:$T$31,12,FALSE))","v":0},{"$f":"IF(Calculations!$C18=\"\",\"\",VLOOKUP($B18,Calculations!$C$3:$T$31,13,FALSE))","v":0},{"$f":"IF(Calculations!$C18=\"\",\"\",VLOOKUP($B18,Calculations!$C$3:$T$31,14,FALSE))","v":0},{"$f":"IF(Calculations!$C18=\"\",\"\",VLOOKUP($B18,Calculations!$C$3:$T$31,17,FALSE))","v":0},{"$f":"IF(Calculations!$C18=\"\",\"\",VLOOKUP($B18,Calculations!$C$3:$U$31,19,FALSE))","v":0}]
[{"$f":"IF(Calculations!$C19=\"\",\"\",ROW($B19)-2)","v":17},{"$f":"IF(Calculations!$C19=\"\",\"\",VLOOKUP(SMALL(Calculations!$A$3:$A$31,A19),Calculations!$A$3:$C$31,3,FALSE))","v":"Tottenham Hotspur"},{"$f":"IF(Calculations!$C19=\"\",\"\",VLOOKUP($B19,Calculations!$C$3:$T$31,2,FALSE))","v":0},{"$f":"IF(Calculations!$C19=\"\",\"\",VLOOKUP($B19,Calculations!$C$3:$T$31,3,FALSE))","v":0},{"$f":"IF(Calculations!$C19=\"\",\"\",VLOOKUP($B19,Calculations!$C$3:$T$31,4,FALSE))","v":0},{"$f":"IF(Calculations!$C19=\"\",\"\",VLOOKUP($B19,Calculations!$C$3:$T$31,5,FALSE))","v":0},{"$f":"IF(Calculations!$C19=\"\",\"\",VLOOKUP($B19,Calculations!$C$3:$T$31,6,FALSE))","v":0},{"$f":"IF(Calculations!$C19=\"\",\"\",VLOOKUP($B19,Calculations!$C$3:$T$31,7,FALSE))","v":0},{"$f":"IF(Calculations!$C19=\"\",\"\",VLOOKUP($B19,Calculations!$C$3:$T$31,10,FALSE))","v":0},{"$f":"IF(Calculations!$C19=\"\",\"\",VLOOKUP($B19,Calculations!$C$3:$T$31,11,FALSE))","v":0},{"$f":"IF(Calculations!$C19=\"\",\"\",VLOOKUP($B19,Calculations!$C$3:$T$31,12,FALSE))","v":0},{"$f":"IF(Calculations!$C19=\"\",\"\",VLOOKUP($B19,Calculations!$C$3:$T$31,13,FALSE))","v":0},{"$f":"IF(Calculations!$C19=\"\",\"\",VLOOKUP($B19,Calculations!$C$3:$T$31,14,FALSE))","v":0},{"$f":"IF(Calculations!$C19=\"\",\"\",VLOOKUP($B19,Calculations!$C$3:$T$31,17,FALSE))","v":0},{"$f":"IF(Calculations!$C19=\"\",\"\",VLOOKUP($B19,Calculations!$C$3:$U$31,19,FALSE))","v":0}]
[{"$f":"IF(Calculations!$C20=\"\",\"\",ROW($B20)-2)","v":18},{"$f":"IF(Calculations!$C20=\"\",\"\",VLOOKUP(SMALL(Calculations!$A$3:$A$31,A20),Calculations!$A$3:$C$31,3,FALSE))","v":"West Bromwich Albion"},{"$f":"IF(Calculations!$C20=\"\",\"\",VLOOKUP($B20,Calculations!$C$3:$T$31,2,FALSE))","v":0},{"$f":"IF(Calculations!$C20=\"\",\"\",VLOOKUP($B20,Calculations!$C$3:$T$31,3,FALSE))","v":0},{"$f":"IF(Calculations!$C20=\"\",\"\",VLOOKUP($B20,Calculations!$C$3:$T$31,4,FALSE))","v":0},{"$f":"IF(Calculations!$C20=\"\",\"\",VLOOKUP($B20,Calculations!$C$3:$T$31,5,FALSE))","v":0},{"$f":"IF(Calculations!$C20=\"\",\"\",VLOOKUP($B20,Calculations!$C$3:$T$31,6,FALSE))","v":0},{"$f":"IF(Calculations!$C20=\"\",\"\",VLOOKUP($B20,Calculations!$C$3:$T$31,7,FALSE))","v":0},{"$f":"IF(Calculations!$C20=\"\",\"\",VLOOKUP($B20,Calculations!$C$3:$T$31,10,FALSE))","v":0},{"$f":"IF(Calculations!$C20=\"\",\"\",VLOOKUP($B20,Calculations!$C$3:$T$31,11,FALSE))","v":0},{"$f":"IF(Calculations!$C20=\"\",\"\",VLOOKUP($B20,Calculations!$C$3:$T$31,12,FALSE))","v":0},{"$f":"IF(Calculations!$C20=\"\",\"\",VLOOKUP($B20,Calculations!$C$3:$T$31,13,FALSE))","v":0},{"$f":"IF(Calculations!$C20=\"\",\"\",VLOOKUP($B20,Calculations!$C$3:$T$31,14,FALSE))","v":0},{"$f":"IF(Calculations!$C20=\"\",\"\",VLOOKUP($B20,Calculations!$C$3:$T$31,17,FALSE))","v":0},{"$f":"IF(Calculations!$C20=\"\",\"\",VLOOKUP($B20,Calculations!$C$3:$U$31,19,FALSE))","v":0}]
[{"$f":"IF(Calculations!$C21=\"\",\"\",ROW($B21)-2)","v":19},{"$f":"IF(Calculations!$C21=\"\",\"\",VLOOKUP(SMALL(Calculations!$A$3:$A$31,A21),Calculations!$A$3:$C$31,3,FALSE))","v":"Wigan Athletic"},{"$f":"IF(Calculations!$C21=\"\",\"\",VLOOKUP($B21,Calculations!$C$3:$T$31,2,FALSE))","v":0},{"$f":"IF(Calculations!$C21=\"\",\"\",VLOOKUP($B21,Calculations!$C$3:$T$31,3,FALSE))","v":0},{"$f":"IF(Calculations!$C21=\"\",\"\",VLOOKUP($B21,Calculations!$C$3:$T$31,4,FALSE))","v":0},{"$f":"IF(Calculations!$C21=\"\",\"\",VLOOKUP($B21,Calculations!$C$3:$T$31,5,FALSE))","v":0},{"$f":"IF(Calculations!$C21=\"\",\"\",VLOOKUP($B21,Calculations!$C$3:$T$31,6,FALSE))","v":0},{"$f":"IF(Calculations!$C21=\"\",\"\",VLOOKUP($B21,Calculations!$C$3:$T$31,7,FALSE))","v":0},{"$f":"IF(Calculations!$C21=\"\",\"\",VLOOKUP($B21,Calculations!$C$3:$T$31,10,FALSE))","v":0},{"$f":"IF(Calculations!$C21=\"\",\"\",VLOOKUP($B21,Calculations!$C$3:$T$31,11,FALSE))","v":0},{"$f":"IF(Calculations!$C21=\"\",\"\",VLOOKUP($B21,Calculations!$C$3:$T$31,12,FALSE))","v":0},{"$f":"IF(Calculations!$C21=\"\",\"\",VLOOKUP($B21,Calculations!$C$3:$T$31,13,FALSE))","v":0},{"$f":"IF(Calculations!$C21=\"\",\"\",VLOOKUP($B21,Calculations!$C$3:$T$31,14,FALSE))","v":0},{"$f":"IF(Calculations!$C21=\"\",\"\",VLOOKUP($B21,Calculations!$C$3:$T$31,17,FALSE))","v":0},{"$f":"IF(Calculations!$C21=\"\",\"\",VLOOKUP($B21,Calculations!$C$3:$U$31,19,FALSE))","v":0}]
[{"$f":"IF(Calculations!$C22=\"\",\"\",ROW($B22)-2)","v":20},{"$f":"IF(Calculations!$C22=\"\",\"\",VLOOKUP(SMALL(Calculations!$A$3:$A$31,A22),Calculations!$A$3:$C$31,3,FALSE))","v":"Wolves"},{"$f":"IF(Calculations!$C22=\"\",\"\",VLOOKUP($B22,Calculations!$C$3:$T$31,2,FALSE))","v":0},{"$f":"IF(Calculations!$C22=\"\",\"\",VLOOKUP($B22,Calculations!$C$3:$T$31,3,FALSE))","v":0},{"$f":"IF(Calculations!$C22=\"\",\"\",VLOOKUP($B22,Calculations!$C$3:$T$31,4,FALSE))","v":0},{"$f":"IF(Calculations!$C22=\"\",\"\",VLOOKUP($B22,Calculations!$C$3:$T$31,5,FALSE))","v":0},{"$f":"IF(Calculations!$C22=\"\",\"\",VLOOKUP($B22,Calculations!$C$3:$T$31,6,FALSE))","v":0},{"$f":"IF(Calculations!$C22=\"\",\"\",VLOOKUP($B22,Calculations!$C$3:$T$31,7,FALSE))","v":0},{"$f":"IF(Calculations!$C22=\"\",\"\",VLOOKUP($B22,Calculations!$C$3:$T$31,10,FALSE))","v":0},{"$f":"IF(Calculations!$C22=\"\",\"\",VLOOKUP($B22,Calculations!$C$3:$T$31,11,FALSE))","v":0},{"$f":"IF(Calculations!$C22=\"\",\"\",VLOOKUP($B22,Calculations!$C$3:$T$31,12,FALSE))","v":0},{"$f":"IF(Calculations!$C22=\"\",\"\",VLOOKUP($B22,Calculations!$C$3:$T$31,13,FALSE))","v":0},{"$f":"IF(Calculations!$C22=\"\",\"\",VLOOKUP($B22,Calculations!$C$3:$T$31,14,FALSE))","v":0},{"$f":"IF(Calculations!$C22=\"\",\"\",VLOOKUP($B22,Calculations!$C$3:$T$31,17,FALSE))","v":0},{"$f":"IF(Calculations!$C22=\"\",\"\",VLOOKUP($B22,Calculations!$C$3:$U$31,19,FALSE))","v":0}]
[{"$f":"IF(Calculations!$C23=\"\",\"\",ROW($B23)-2)","v":""},{"$f":"IF(Calculations!$C23=\"\",\"\",VLOOKUP(SMALL(Calculations!$A$3:$A$31,A23),Calculations!$A$3:$C$31,3,FALSE))","v":""},{"$f":"IF(Calculations!$C23=\"\",\"\",VLOOKUP($B23,Calculations!$C$3:$T$31,2,FALSE))","v":""},{"$f":"IF(Calculations!$C23=\"\",\"\",VLOOKUP($B23,Calculations!$C$3:$T$31,3,FALSE))","v":""},{"$f":"IF(Calculations!$C23=\"\",\"\",VLOOKUP($B23,Calculations!$C$3:$T$31,4,FALSE))","v":""},{"$f":"IF(Calculations!$C23=\"\",\"\",VLOOKUP($B23,Calculations!$C$3:$T$31,5,FALSE))","v":""},{"$f":"IF(Calculations!$C23=\"\",\"\",VLOOKUP($B23,Calculations!$C$3:$T$31,6,FALSE))","v":""},{"$f":"IF(Calculations!$C23=\"\",\"\",VLOOKUP($B23,Calculations!$C$3:$T$31,7,FALSE))","v":""},{"$f":"IF(Calculations!$C23=\"\",\"\",VLOOKUP($B23,Calculations!$C$3:$T$31,10,FALSE))","v":""},{"$f":"IF(Calculations!$C23=\"\",\"\",VLOOKUP($B23,Calculations!$C$3:$T$31,11,FALSE))","v":""},{"$f":"IF(Calculations!$C23=\"\",\"\",VLOOKUP($B23,Calculations!$C$3:$T$31,12,FALSE))","v":""},{"$f":"IF(Calculations!$C23=\"\",\"\",VLOOKUP($B23,Calculations!$C$3:$T$31,13,FALSE))","v":""},{"$f":"IF(Calculations!$C23=\"\",\"\",VLOOKUP($B23,Calculations!$C$3:$T$31,14,FALSE))","v":""},{"$f":"IF(Calculations!$C23=\"\",\"\",VLOOKUP($B23,Calculations!$C$3:$T$31,17,FALSE))","v":""},{"$f":"IF(Calculations!$C23=\"\",\"\",VLOOKUP($B23,Calculations!$C$3:$U$31,19,FALSE))","v":""}]
[{"$f":"IF(Calculations!$C24=\"\",\"\",ROW($B24)-2)","v":""},{"$f":"IF(Calculations!$C24=\"\",\"\",VLOOKUP(SMALL(Calculations!$A$3:$A$31,A24),Calculations!$A$3:$C$31,3,FALSE))","v":""},{"$f":"IF(Calculations!$C24=\"\",\"\",VLOOKUP($B24,Calculations!$C$3:$T$31,2,FALSE))","v":""},{"$f":"IF(Calculations!$C24=\"\",\"\",VLOOKUP($B24,Calculations!$C$3:$T$31,3,FALSE))","v":""},{"$f":"IF(Calculations!$C24=\"\",\"\",VLOOKUP($B24,Calculations!$C$3:$T$31,4,FALSE))","v":""},{"$f":"IF(Calculations!$C24=\"\",\"\",VLOOKUP($B24,Calculations!$C$3:$T$31,5,FALSE))","v":""},{"$f":"IF(Calculations!$C24=\"\",\"\",VLOOKUP($B24,Calculations!$C$3:$T$31,6,FALSE))","v":""},{"$f":"IF(Calculations!$C24=\"\",\"\",VLOOKUP($B24,Calculations!$C$3:$T$31,7,FALSE))","v":""},{"$f":"IF(Calculations!$C24=\"\",\"\",VLOOKUP($B24,Calculations!$C$3:$T$31,10,FALSE))","v":""},{"$f":"IF(Calculations!$C24=\"\",\"\",VLOOKUP($B24,Calculations!$C$3:$T$31,11,FALSE))","v":""},{"$f":"IF(Calculations!$C24=\"\",\"\",VLOOKUP($B24,Calculations!$C$3:$T$31,12,FALSE))","v":""},{"$f":"IF(Calculations!$C24=\"\",\"\",VLOOKUP($B24,Calculations!$C$3:$T$31,13,FALSE))","v":""},{"$f":"IF(Calculations!$C24=\"\",\"\",VLOOKUP($B24,Calculations!$C$3:$T$31,14,FALSE))","v":""},{"$f":"IF(Calculations!$C24=\"\",\"\",VLOOKUP($B24,Calculations!$C$3:$T$31,17,FALSE))","v":""},{"$f":"IF(Calculations!$C24=\"\",\"\",VLOOKUP($B24,Calculations!$C$3:$U$31,19,FALSE))","v":""}]
[{"$f":"IF(Calculations!$C25=\"\",\"\",ROW($B25)-2)","v":""},{"$f":"IF(Calculations!$C25=\"\",\"\",VLOOKUP(SMALL(Calculations!$A$3:$A$31,A25),Calculations!$A$3:$C$31,3,FALSE))","v":""},{"$f":"IF(Calculations!$C25=\"\",\"\",VLOOKUP($B25,Calculations!$C$3:$T$31,2,FALSE))","v":""},{"$f":"IF(Calculations!$C25=\"\",\"\",VLOOKUP($B25,Calculations!$C$3:$T$31,3,FALSE))","v":""},{"$f":"IF(Calculations!$C25=\"\",\"\",VLOOKUP($B25,Calculations!$C$3:$T$31,4,FALSE))","v":""},{"$f":"IF(Calculations!$C25=\"\",\"\",VLOOKUP($B25,Calculations!$C$3:$T$31,5,FALSE))","v":""},{"$f":"IF(Calculations!$C25=\"\",\"\",VLOOKUP($B25,Calculations!$C$3:$T$31,6,FALSE))","v":""},{"$f":"IF(Calculations!$C25=\"\",\"\",VLOOKUP($B25,Calculations!$C$3:$T$31,7,FALSE))","v":""},{"$f":"IF(Calculations!$C25=\"\",\"\",VLOOKUP($B25,Calculations!$C$3:$T$31,10,FALSE))","v":""},{"$f":"IF(Calculations!$C25=\"\",\"\",VLOOKUP($B25,Calculations!$C$3:$T$31,11,FALSE))","v":""},{"$f":"IF(Calculations!$C25=\"\",\"\",VLOOKUP($B25,Calculations!$C$3:$T$31,12,FALSE))","v":""},{"$f":"IF(Calculations!$C25=\"\",\"\",VLOOKUP($B25,Calculations!$C$3:$T$31,13,FALSE))","v":""},{"$f":"IF(Calculations!$C25=\"\",\"\",VLOOKUP($B25,Calculations!$C$3:$T$31,14,FALSE))","v":""},{"$f":"IF(Calculations!$C25=\"\",\"\",VLOOKUP($B25,Calculations!$C$3:$T$31,17,FALSE))","v":""},{"$f":"IF(Calculations!$C25=\"\",\"\",VLOOKUP($B25,Calculations!$C$3:$U$31,19,FALSE))","v":""}]
[{"$f":"IF(Calculations!$C26=\"\",\"\",ROW($B26)-2)","v":""},{"$f":"IF(Calculations!$C26=\"\",\"\",VLOOKUP(SMALL(Calculations!$A$3:$A$31,A26),Calculations!$A$3:$C$31,3,FALSE))","v":""},{"$f":"IF(Calculations!$C26=\"\",\"\",VLOOKUP($B26,Calculations!$C$3:$T$31,2,FALSE))","v":""},{"$f":"IF(Calculations!$C26=\"\",\"\",VLOOKUP($B26,Calculations!$C$3:$T$31,3,FALSE))","v":""},{"$f":"IF(Calculations!$C26=\"\",\"\",VLOOKUP($B26,Calculations!$C$3:$T$31,4,FALSE))","v":""},{"$f":"IF(Calculations!$C26=\"\",\"\",VLOOKUP($B26,Calculations!$C$3:$T$31,5,FALSE))","v":""},{"$f":"IF(Calculations!$C26=\"\",\"\",VLOOKUP($B26,Calculations!$C$3:$T$31,6,FALSE))","v":""},{"$f":"IF(Calculations!$C26=\"\",\"\",VLOOKUP($B26,Calculations!$C$3:$T$31,7,FALSE))","v":""},{"$f":"IF(Calculations!$C26=\"\",\"\",VLOOKUP($B26,Calculations!$C$3:$T$31,10,FALSE))","v":""},{"$f":"IF(Calculations!$C26=\"\",\"\",VLOOKUP($B26,Calculations!$C$3:$T$31,11,FALSE))","v":""},{"$f":"IF(Calculations!$C26=\"\",\"\",VLOOKUP($B26,Calculations!$C$3:$T$31,12,FALSE))","v":""},{"$f":"IF(Calculations!$C26=\"\",\"\",VLOOKUP($B26,Calculations!$C$3:$T$31,13,FALSE))","v":""},{"$f":"IF(Calculations!$C26=\"\",\"\",VLOOKUP($B26,Calculations!$C$3:$T$31,14,FALSE))","v":""},{"$f":"IF(Calculations!$C26=\"\",\"\",VLOOKUP($B26,Calculations!$C$3:$T$31,17,FALSE))","v":""},{"$f":"IF(Calculations!$C26=\"\",\"\",VLOOKUP($B26,Calculations!$C$3:$U$31,19,FALSE))","v":""}]
[{"$f":"IF(Calculations!$C27=\"\",\"\",ROW($B27)-2)","v":""},{"$f":"IF(Calculations!$C27=\"\",\"\",VLOOKUP(SMALL(Calculations!$A$3:$A$31,A27),Calculations!$A$3:$C$31,3,FALSE))","v":""},{"$f":"IF(Calculations!$C27=\"\",\"\",VLOOKUP($B27,Calculations!$C$3:$T$31,2,FALSE))","v":""},{"$f":"IF(Calculations!$C27=\"\",\"\",VLOOKUP($B27,Calculations!$C$3:$T$31,3,FALSE))","v":""},{"$f":"IF(Calculations!$C27=\"\",\"\",VLOOKUP($B27,Calculations!$C$3:$T$31,4,FALSE))","v":""},{"$f":"IF(Calculations!$C27=\"\",\"\",VLOOKUP($B27,Calculations!$C$3:$T$31,5,FALSE))","v":""},{"$f":"IF(Calculations!$C27=\"\",\"\",VLOOKUP($B27,Calculations!$C$3:$T$31,6,FALSE))","v":""},{"$f":"IF(Calculations!$C27=\"\",\"\",VLOOKUP($B27,Calculations!$C$3:$T$31,7,FALSE))","v":""},{"$f":"IF(Calculations!$C27=\"\",\"\",VLOOKUP($B27,Calculations!$C$3:$T$31,10,FALSE))","v":""},{"$f":"IF(Calculations!$C27=\"\",\"\",VLOOKUP($B27,Calculations!$C$3:$T$31,11,FALSE))","v":""},{"$f":"IF(Calculations!$C27=\"\",\"\",VLOOKUP($B27,Calculations!$C$3:$T$31,12,FALSE))","v":""},{"$f":"IF(Calculations!$C27=\"\",\"\",VLOOKUP($B27,Calculations!$C$3:$T$31,13,FALSE))","v":""},{"$f":"IF(Calculations!$C27=\"\",\"\",VLOOKUP($B27,Calculations!$C$3:$T$31,14,FALSE))","v":""},{"$f":"IF(Calculations!$C27=\"\",\"\",VLOOKUP($B27,Calculations!$C$3:$T$31,17,FALSE))","v":""},{"$f":"IF(Calculations!$C27=\"\",\"\",VLOOKUP($B27,Calculations!$C$3:$U$31,19,FALSE))","v":""}]
[{"$f":"IF(Calculations!$C28=\"\",\"\",ROW($B28)-2)","v":""},{"$f":"IF(Calculations!$C28=\"\",\"\",VLOOKUP(SMALL(Calculations!$A$3:$A$31,A28),Calculations!$A$3:$C$31,3,FALSE))","v":""},{"$f":"IF(Calculations!$C28=\"\",\"\",VLOOKUP($B28,Calculations!$C$3:$T$31,2,FALSE))","v":""},{"$f":"IF(Calculations!$C28=\"\",\"\",VLOOKUP($B28,Calculations!$C$3:$T$31,3,FALSE))","v":""},{"$f":"IF(Calculations!$C28=\"\",\"\",VLOOKUP($B28,Calculations!$C$3:$T$31,4,FALSE))","v":""},{"$f":"IF(Calculations!$C28=\"\",\"\",VLOOKUP($B28,Calculations!$C$3:$T$31,5,FALSE))","v":""},{"$f":"IF(Calculations!$C28=\"\",\"\",VLOOKUP($B28,Calculations!$C$3:$T$31,6,FALSE))","v":""},{"$f":"IF(Calculations!$C28=\"\",\"\",VLOOKUP($B28,Calculations!$C$3:$T$31,7,FALSE))","v":""},{"$f":"IF(Calculations!$C28=\"\",\"\",VLOOKUP($B28,Calculations!$C$3:$T$31,10,FALSE))","v":""},{"$f":"IF(Calculations!$C28=\"\",\"\",VLOOKUP($B28,Calculations!$C$3:$T$31,11,FALSE))","v":""},{"$f":"IF(Calculations!$C28=\"\",\"\",VLOOKUP($B28,Calculations!$C$3:$T$31,12,FALSE))","v":""},{"$f":"IF(Calculations!$C28=\"\",\"\",VLOOKUP($B28,Calculations!$C$3:$T$31,13,FALSE))","v":""},{"$f":"IF(Calculations!$C28=\"\",\"\",VLOOKUP($B28,Calculations!$C$3:$T$31,14,FALSE))","v":""},{"$f":"IF(Calculations!$C28=\"\",\"\",VLOOKUP($B28,Calculations!$C$3:$T$31,17,FALSE))","v":""},{"$f":"IF(Calculations!$C28=\"\",\"\",VLOOKUP($B28,Calculations!$C$3:$U$31,19,FALSE))","v":""}]
[{"$f":"IF(Calculations!$C29=\"\",\"\",ROW($B29)-2)","v":""},{"$f":"IF(Calculations!$C29=\"\",\"\",VLOOKUP(SMALL(Calculations!$A$3:$A$31,A29),Calculations!$A$3:$C$31,3,FALSE))","v":""},{"$f":"IF(Calculations!$C29=\"\",\"\",VLOOKUP($B29,Calculations!$C$3:$T$31,2,FALSE))","v":""},{"$f":"IF(Calculations!$C29=\"\",\"\",VLOOKUP($B29,Calculations!$C$3:$T$31,3,FALSE))","v":""},{"$f":"IF(Calculations!$C29=\"\",\"\",VLOOKUP($B29,Calculations!$C$3:$T$31,4,FALSE))","v":""},{"$f":"IF(Calculations!$C29=\"\",\"\",VLOOKUP($B29,Calculations!$C$3:$T$31,5,FALSE))","v":""},{"$f":"IF(Calculations!$C29=\"\",\"\",VLOOKUP($B29,Calculations!$C$3:$T$31,6,FALSE))","v":""},{"$f":"IF(Calculations!$C29=\"\",\"\",VLOOKUP($B29,Calculations!$C$3:$T$31,7,FALSE))","v":""},{"$f":"IF(Calculations!$C29=\"\",\"\",VLOOKUP($B29,Calculations!$C$3:$T$31,10,FALSE))","v":""},{"$f":"IF(Calculations!$C29=\"\",\"\",VLOOKUP($B29,Calculations!$C$3:$T$31,11,FALSE))","v":""},{"$f":"IF(Calculations!$C29=\"\",\"\",VLOOKUP($B29,Calculations!$C$3:$T$31,12,FALSE))","v":""},{"$f":"IF(Calculations!$C29=\"\",\"\",VLOOKUP($B29,Calculations!$C$3:$T$31,13,FALSE))","v":""},{"$f":"IF(Calculations!$C29=\"\",\"\",VLOOKUP($B29,Calculations!$C$3:$T$31,14,FALSE))","v":""},{"$f":"IF(Calculations!$C29=\"\",\"\",VLOOKUP($B29,Calculations!$C$3:$T$31,17,FALSE))","v":""},{"$f":"IF(Calculations!$C29=\"\",\"\",VLOOKUP($B29,Calculations!$C$3:$U$31,19,FALSE))","v":""}]
[{"$f":"IF(Calculations!$C30=\"\",\"\",ROW($B30)-2)","v":""},{"$f":"IF(Calculations!$C30=\"\",\"\",VLOOKUP(SMALL(Calculations!$A$3:$A$31,A30),Calculations!$A$3:$C$31,3,FALSE))","v":""},{"$f":"IF(Calculations!$C30=\"\",\"\",VLOOKUP($B30,Calculations!$C$3:$T$31,2,FALSE))","v":""},{"$f":"IF(Calculations!$C30=\"\",\"\",VLOOKUP($B30,Calculations!$C$3:$T$31,3,FALSE))","v":""},{"$f":"IF(Calculations!$C30=\"\",\"\",VLOOKUP($B30,Calculations!$C$3:$T$31,4,FALSE))","v":""},{"$f":"IF(Calculations!$C30=\"\",\"\",VLOOKUP($B30,Calculations!$C$3:$T$31,5,FALSE))","v":""},{"$f":"IF(Calculations!$C30=\"\",\"\",VLOOKUP($B30,Calculations!$C$3:$T$31,6,FALSE))","v":""},{"$f":"IF(Calculations!$C30=\"\",\"\",VLOOKUP($B30,Calculations!$C$3:$T$31,7,FALSE))","v":""},{"$f":"IF(Calculations!$C30=\"\",\"\",VLOOKUP($B30,Calculations!$C$3:$T$31,10,FALSE))","v":""},{"$f":"IF(Calculations!$C30=\"\",\"\",VLOOKUP($B30,Calculations!$C$3:$T$31,11,FALSE))","v":""},{"$f":"IF(Calculations!$C30=\"\",\"\",VLOOKUP($B30,Calculations!$C$3:$T$31,12,FALSE))","v":""},{"$f":"IF(Calculations!$C30=\"\",\"\",VLOOKUP($B30,Calculations!$C$3:$T$31,13,FALSE))","v":""},{"$f":"IF(Calculations!$C30=\"\",\"\",VLOOKUP($B30,Calculations!$C$3:$T$31,14,FALSE))","v":""},{"$f":"IF(Calculations!$C30=\"\",\"\",VLOOKUP($B30,Calculations!$C$3:$T$31,17,FALSE))","v":""},{"$f":"IF(Calculations!$C30=\"\",\"\",VLOOKUP($B30,Calculations!$C$3:$U$31,19,FALSE))","v":""}]
[{"$f":"IF(Calculations!$C31=\"\",\"\",ROW($B31)-2)","v":""},{"$f":"IF(Calculations!$C31=\"\",\"\",VLOOKUP(SMALL(Calculations!$A$3:$A$31,A31),Calculations!$A$3:$C$31,3,FALSE))","v":""},{"$f":"IF(Calculations!$C31=\"\",\"\",VLOOKUP($B31,Calculations!$C$3:$T$31,2,FALSE))","v":""},{"$f":"IF(Calculations!$C31=\"\",\"\",VLOOKUP($B31,Calculations!$C$3:$T$31,3,FALSE))","v":""},{"$f":"IF(Calculations!$C31=\"\",\"\",VLOOKUP($B31,Calculations!$C$3:$T$31,4,FALSE))","v":""},{"$f":"IF(Calculations!$C31=\"\",\"\",VLOOKUP($B31,Calculations!$C$3:$T$31,5,FALSE))","v":""},{"$f":"IF(Calculations!$C31=\"\",\"\",VLOOKUP($B31,Calculations!$C$3:$T$31,6,FALSE))","v":""},{"$f":"IF(Calculations!$C31=\"\",\"\",VLOOKUP($B31,Calculations!$C$3:$T$31,7,FALSE))","v":""},{"$f":"IF(Calculations!$C31=\"\",\"\",VLOOKUP($B31,Calculations!$C$3:$T$31,10,FALSE))","v":""},{"$f":"IF(Calculations!$C31=\"\",\"\",VLOOKUP($B31,Calculations!$C$3:$T$31,11,FALSE))","v":""},{"$f":"IF(Calculations!$C31=\"\",\"\",VLOOKUP($B31,Calculations!$C$3:$T$31,12,FALSE))","v":""},{"$f":"IF(Calculations!$C31=\"\",\"\",VLOOKUP($B31,Calculations!$C$3:$T$31,13,FALSE))","v":""},{"$f":"IF(Calculations!$C31=\"\",\"\",VLOOKUP($B31,Calculations!$C$3:$T$31,14,FALSE))","v":""},{"$f":"IF(Calculations!$C31=\"\",\"\",VLOOKUP($B31,Calculations!$C$3:$T$31,17,FALSE))","v":""},{"$f":"IF(Calculations!$C31=\"\",\"\",VLOOKUP($B31,Calculations!$C$3:$U$31,19,FALSE))","v":""}]

{"sheet":"Random","index":6,"n_rows":51,"n_cols":4,"rows_kept":51,"cut":false,"hidden":true,"merged":[]}
["Teams","Random Number","ID"]
[{"$f":"IF(Teams!A2=\"\",\"\",Teams!A2)","v":"Arsenal"},{"$f":"IF(A2=\"\",\"\",RAND())","v":0.93614486534998631},{"$f":"IF(B2=\"\",\"\",RANK(B2,INDIRECT(\"$B$2:$B$\"&Teams!$E$6+1))+COUNTIF(C$1:C1,C1)-1)","v":4},"Bolton Wanderers"]
[{"$f":"IF(Teams!A3=\"\",\"\",Teams!A3)","v":"Aston Villa"},0.37568086516485488,{"$f":"IF(B3=\"\",\"\",RANK(B3,INDIRECT(\"$B$2:$B$\"&Teams!$E$6+1))+COUNTIF(C$1:C2,C2)-1)","v":14},"Swansea City"]
[{"$f":"IF(Teams!A4=\"\",\"\",Teams!A4)","v":"Blackburn Rovers"},0.30034257412095788,{"$f":"IF(B4=\"\",\"\",RANK(B4,INDIRECT(\"$B$2:$B$\"&Teams!$E$6+1))+COUNTIF(C$1:C3,C3)-1)","v":18},"Manchester City"]
[{"$f":"IF(Teams!A5=\"\",\"\",Teams!A5)","v":"Bolton Wanderers"},0.81736170428687893,{"$f":"IF(B5=\"\",\"\",RANK(B5,INDIRECT(\"$B$2:$B$\"&Teams!$E$6+1))+COUNTIF(C$1:C4,C4)-1)","v":6},"Queens Park Rangers"]
[{"$f":"IF(Teams!A6=\"\",\"\",Teams!A6)","v":"Chelsea"},0.48757440134105934,{"$f":"IF(B6=\"\",\"\",RANK(B6,INDIRECT(\"$B$2:$B$\"&Teams!$E$6+1))+COUNTIF(C$1:C5,C5)-1)","v":10},"Tottenham Hotspur"]
[{"$f":"IF(Teams!A7=\"\",\"\",Teams!A7)","v":"Everton"},0.131219875858957,{"$f":"IF(B7=\"\",\"\",RANK(B7,INDIRECT(\"$B$2:$B$\"&Teams!$E$6+1))+COUNTIF(C$1:C6,C6)-1)","v":19},"Stoke City"]
[{"$f":"IF(Teams!A8=\"\",\"\",Teams!A8)","v":"Fulham"},0.60894594460954732,{"$f":"IF(B8=\"\",\"\",RANK(B8,INDIRECT(\"$B$2:$B$\"&Teams!$E$6+1))+COUNTIF(C$1:C7,C7)-1)","v":9},"West Bromwich Albion"]
[{"$f":"IF(Teams!A9=\"\",\"\",Teams!A9)","v":"Liverpool"},0.36966564661092338,{"$f":"IF(B9=\"\",\"\",RANK(B9,INDIRECT(\"$B$2:$B$\"&Teams!$E$6+1))+COUNTIF(C$1:C8,C8)-1)","v":15},"Everton"]
[{"$f":"IF(Teams!A10=\"\",\"\",Teams!A10)","v":"Manchester City"},0.66071541354129737,{"$f":"IF(B10=\"\",\"\",RANK(B10,INDIRECT(\"$B$2:$B$\"&Teams!$E$6+1))+COUNTIF(C$1:C9,C9)-1)","v":7},"Norwich"]
[{"$f":"IF(Teams!A11=\"\",\"\",Teams!A11)","v":"Manchester United"},0.94501508989413163,{"$f":"IF(B11=\"\",\"\",RANK(B11,INDIRECT(\"$B$2:$B$\"&Teams!$E$6+1))+COUNTIF(C$1:C10,C10)-1)","v":3},"Blackburn Rovers"]
[{"$f":"IF(Teams!A12=\"\",\"\",Teams!A12)","v":"Newcastle United"},0.43303051857190289,{"$f":"IF(B12=\"\",\"\",RANK(B12,INDIRECT(\"$B$2:$B$\"&Teams!$E$6+1))+COUNTIF(C$1:C11,C11)-1)","v":11},"Manchester United"]
[{"$f":"IF(Teams!A13=\"\",\"\",Teams!A13)","v":"Norwich"},0.3797943565335351,{"$f":"IF(B13=\"\",\"\",RANK(B13,INDIRECT(\"$B$2:$B$\"&Teams!$E$6+1))+COUNTIF(C$1:C12,C12)-1)","v":13},"Sunderland"]
[{"$f":"IF(Teams!A14=\"\",\"\",Teams!A14)","v":"Queens Park Rangers"},6.1280299540742433E-2,{"$f":"IF(B14=\"\",\"\",RANK(B14,INDIRECT(\"$B$2:$B$\"&Teams!$E$6+1))+COUNTIF(C$1:C13,C13)-1)","v":20},"Aston Villa"]
[{"$f":"IF(Teams!A15=\"\",\"\",Teams!A15)","v":"Stoke City"},0.62894394554816002,{"$f":"IF(B15=\"\",\"\",RANK(B15,INDIRECT(\"$B$2:$B$\"&Teams!$E$6+1))+COUNTIF(C$1:C14,C14)-1)","v":8},"Newcastle United"]
[{"$f":"IF(Teams!A16=\"\",\"\",Teams!A16)","v":"Sunderland"},0.93465305474942506,{"$f":"IF(B16=\"\",\"\",RANK(B16,INDIRECT(\"$B$2:$B$\"&Teams!$E$6+1))+COUNTIF(C$1:C15,C15)-1)","v":5},"Wolves"]
[{"$f":"IF(Teams!A17=\"\",\"\",Teams!A17)","v":"Swansea City"},0.36890327029421577,{"$f":"IF(B17=\"\",\"\",RANK(B17,INDIRECT(\"$B$2:$B$\"&Teams!$E$6+1))+COUNTIF(C$1:C16,C16)-1)","v":16},"Fulham"]
[{"$f":"IF(Teams!A18=\"\",\"\",Teams!A18)","v":"Tottenham Hotspur"},0.94708125544605948,{"$f":"IF(B18=\"\",\"\",RANK(B18,INDIRECT(\"$B$2:$B$\"&Teams!$E$6+1))+COUNTIF(C$1:C17,C17)-1)","v":2},"Liverpool"]
[{"$f":"IF(Teams!A19=\"\",\"\",Teams!A19)","v":"West Bromwich Albion"},0.99727980747702649,{"$f":"IF(B19=\"\",\"\",RANK(B19,INDIRECT(\"$B$2:$B$\"&Teams!$E$6+1))+COUNTIF(C$1:C18,C18)-1)","v":1},"Chelsea"]
[{"$f":"IF(Teams!A20=\"\",\"\",Teams!A20)","v":"Wigan Athletic"},0.41587705867584901,{"$f":"IF(B20=\"\",\"\",RANK(B20,INDIRECT(\"$B$2:$B$\"&Teams!$E$6+1))+COUNTIF(C$1:C19,C19)-1)","v":12},"Arsenal"]
[{"$f":"IF(Teams!A21=\"\",\"\",Teams!A21)","v":"Wolves"},0.32871934324173835,{"$f":"IF(B21=\"\",\"\",RANK(B21,INDIRECT(\"$B$2:$B$\"&Teams!$E$6+1))+COUNTIF(C$1:C20,C20)-1)","v":17},"Wigan Athletic"]
[{"$f":"IF(Teams!A22=\"\",\"\",Teams!A22)","v":""},"",{"$f":"IF(B22=\"\",\"\",RANK(B22,INDIRECT(\"$B$2:$B$\"&Teams!$E$6+1))+COUNTIF(C$1:C21,C21)-1)","v":""}]
[{"$f":"IF(Teams!A23=\"\",\"\",Teams!A23)","v":""},"",{"$f":"IF(B23=\"\",\"\",RANK(B23,INDIRECT(\"$B$2:$B$\"&Teams!$E$6+1))+COUNTIF(C$1:C22,C22)-1)","v":""}]
[{"$f":"IF(Teams!A24=\"\",\"\",Teams!A24)","v":""},"",{"$f":"IF(B24=\"\",\"\",RANK(B24,INDIRECT(\"$B$2:$B$\"&Teams!$E$6+1))+COUNTIF(C$1:C23,C23)-1)","v":""}]
[{"$f":"IF(Teams!A25=\"\",\"\",Teams!A25)","v":""},"",{"$f":"IF(B25=\"\",\"\",RANK(B25,INDIRECT(\"$B$2:$B$\"&Teams!$E$6+1))+COUNTIF(C$1:C24,C24)-1)","v":""}]
[{"$f":"IF(Teams!A26=\"\",\"\",Teams!A26)","v":""},"",{"$f":"IF(B26=\"\",\"\",RANK(B26,INDIRECT(\"$B$2:$B$\"&Teams!$E$6+1))+COUNTIF(C$1:C25,C25)-1)","v":""}]
[{"$f":"IF(Teams!A27=\"\",\"\",Teams!A27)","v":""},"",{"$f":"IF(B27=\"\",\"\",RANK(B27,INDIRECT(\"$B$2:$B$\"&Teams!$E$6+1))+COUNTIF(C$1:C26,C26)-1)","v":""}]
[{"$f":"IF(Teams!A28=\"\",\"\",Teams!A28)","v":""},"",{"$f":"IF(B28=\"\",\"\",RANK(B28,INDIRECT(\"$B$2:$B$\"&Teams!$E$6+1))+COUNTIF(C$1:C27,C27)-1)","v":""}]
[{"$f":"IF(Teams!A29=\"\",\"\",Teams!A29)","v":""},"",{"$f":"IF(B29=\"\",\"\",RANK(B29,INDIRECT(\"$B$2:$B$\"&Teams!$E$6+1))+COUNTIF(C$1:C28,C28)-1)","v":""}]
[{"$f":"IF(Teams!A30=\"\",\"\",Teams!A30)","v":""},"",{"$f":"IF(B30=\"\",\"\",RANK(B30,INDIRECT(\"$B$2:$B$\"&Teams!$E$6+1))+COUNTIF(C$1:C29,C29)-1)","v":""}]
[{"$f":"IF(Teams!A31=\"\",\"\",Teams!A31)","v":""},"",{"$f":"IF(B31=\"\",\"\",RANK(B31,INDIRECT(\"$B$2:$B$\"&Teams!$E$6+1))+COUNTIF(C$1:C30,C30)-1)","v":""}]
[{"$f":"IF(Teams!A32=\"\",\"\",Teams!A32)","v":""},"",{"$f":"IF(B32=\"\",\"\",RANK(B32,INDIRECT(\"$B$2:$B$\"&Teams!$E$6+1))+COUNTIF(C$1:C31,C31)-1)","v":""}]
[{"$f":"IF(Teams!A33=\"\",\"\",Teams!A33)","v":""},"",{"$f":"IF(B33=\"\",\"\",RANK(B33,INDIRECT(\"$B$2:$B$\"&Teams!$E$6+1))+COUNTIF(C$1:C32,C32)-1)","v":""}]
[{"$f":"IF(Teams!A34=\"\",\"\",Teams!A34)","v":""},"",{"$f":"IF(B34=\"\",\"\",RANK(B34,INDIRECT(\"$B$2:$B$\"&Teams!$E$6+1))+COUNTIF(C$1:C33,C33)-1)","v":""}]
[{"$f":"IF(Teams!A35=\"\",\"\",Teams!A35)","v":""},"",{"$f":"IF(B35=\"\",\"\",RANK(B35,INDIRECT(\"$B$2:$B$\"&Teams!$E$6+1))+COUNTIF(C$1:C34,C34)-1)","v":""}]
[{"$f":"IF(Teams!A36=\"\",\"\",Teams!A36)","v":""},"",{"$f":"IF(B36=\"\",\"\",RANK(B36,INDIRECT(\"$B$2:$B$\"&Teams!$E$6+1))+COUNTIF(C$1:C35,C35)-1)","v":""}]
[{"$f":"IF(Teams!A37=\"\",\"\",Teams!A37)","v":""},"",{"$f":"IF(B37=\"\",\"\",RANK(B37,INDIRECT(\"$B$2:$B$\"&Teams!$E$6+1))+COUNTIF(C$1:C36,C36)-1)","v":""}]
[{"$f":"IF(Teams!A38=\"\",\"\",Teams!A38)","v":""},"",{"$f":"IF(B38=\"\",\"\",RANK(B38,INDIRECT(\"$B$2:$B$\"&Teams!$E$6+1))+COUNTIF(C$1:C37,C37)-1)","v":""}]
[{"$f":"IF(Teams!A39=\"\",\"\",Teams!A39)","v":""},"",{"$f":"IF(B39=\"\",\"\",RANK(B39,INDIRECT(\"$B$2:$B$\"&Teams!$E$6+1))+COUNTIF(C$1:C38,C38)-1)","v":""}]
[{"$f":"IF(Teams!A40=\"\",\"\",Teams!A40)","v":""},"",{"$f":"IF(B40=\"\",\"\",RANK(B40,INDIRECT(\"$B$2:$B$\"&Teams!$E$6+1))+COUNTIF(C$1:C39,C39)-1)","v":""}]
[{"$f":"IF(Teams!A41=\"\",\"\",Teams!A41)","v":""},"",{"$f":"IF(B41=\"\",\"\",RANK(B41,INDIRECT(\"$B$2:$B$\"&Teams!$E$6+1))+COUNTIF(C$1:C40,C40)-1)","v":""}]
[{"$f":"IF(Teams!A42=\"\",\"\",Teams!A42)","v":""},"",{"$f":"IF(B42=\"\",\"\",RANK(B42,INDIRECT(\"$B$2:$B$\"&Teams!$E$6+1))+COUNTIF(C$1:C41,C41)-1)","v":""}]
[{"$f":"IF(Teams!A43=\"\",\"\",Teams!A43)","v":""},"",{"$f":"IF(B43=\"\",\"\",RANK(B43,INDIRECT(\"$B$2:$B$\"&Teams!$E$6+1))+COUNTIF(C$1:C42,C42)-1)","v":""}]
[{"$f":"IF(Teams!A44=\"\",\"\",Teams!A44)","v":""},"",{"$f":"IF(B44=\"\",\"\",RANK(B44,INDIRECT(\"$B$2:$B$\"&Teams!$E$6+1))+COUNTIF(C$1:C43,C43)-1)","v":""}]
[{"$f":"IF(Teams!A45=\"\",\"\",Teams!A45)","v":""},"",{"$f":"IF(B45=\"\",\"\",RANK(B45,INDIRECT(\"$B$2:$B$\"&Teams!$E$6+1))+COUNTIF(C$1:C44,C44)-1)","v":""}]
[{"$f":"IF(Teams!A46=\"\",\"\",Teams!A46)","v":""},"",{"$f":"IF(B46=\"\",\"\",RANK(B46,INDIRECT(\"$B$2:$B$\"&Teams!$E$6+1))+COUNTIF(C$1:C45,C45)-1)","v":""}]
[{"$f":"IF(Teams!A47=\"\",\"\",Teams!A47)","v":""},"",{"$f":"IF(B47=\"\",\"\",RANK(B47,INDIRECT(\"$B$2:$B$\"&Teams!$E$6+1))+COUNTIF(C$1:C46,C46)-1)","v":""}]
[{"$f":"IF(Teams!A48=\"\",\"\",Teams!A48)","v":""},"",{"$f":"IF(B48=\"\",\"\",RANK(B48,INDIRECT(\"$B$2:$B$\"&Teams!$E$6+1))+COUNTIF(C$1:C47,C47)-1)","v":""}]
[{"$f":"IF(Teams!A49=\"\",\"\",Teams!A49)","v":""},"",{"$f":"IF(B49=\"\",\"\",RANK(B49,INDIRECT(\"$B$2:$B$\"&Teams!$E$6+1))+COUNTIF(C$1:C48,C48)-1)","v":""}]
[{"$f":"IF(Teams!A50=\"\",\"\",Teams!A50)","v":""},"",{"$f":"IF(B50=\"\",\"\",RANK(B50,INDIRECT(\"$B$2:$B$\"&Teams!$E$6+1))+COUNTIF(C$1:C49,C49)-1)","v":""}]
[{"$f":"IF(Teams!A51=\"\",\"\",Teams!A51)","v":""},"",{"$f":"IF(B51=\"\",\"\",RANK(B51,INDIRECT(\"$B$2:$B$\"&Teams!$E$6+1))+COUNTIF(C$1:C50,C50)-1)","v":""}]

{"sheet":"Data","index":7,"n_rows":3,"n_cols":2,"rows_kept":3,"cut":false,"hidden":true,"merged":[]}
["Pts earned"]
["Win",3]
["Draw",1]