{"text_format":"1","workbook":"xlsx","n_sheets":8,"sheets":["Teams","Home","Away","Fixtures","Calculations","League Table","Random","Data"],"not_rendered":{"charts":0,"images":0,"macros":1,"external_links":0,"defined_names":0,"comments":0,"pivot_tables":0},"unopened":[],"bounds":{"document_bytes":16777216,"sheet_cells":100000,"rows_first":2000,"rows_last":500,"rows_between":2000,"halvings":0,"cell_chars":16384,"cell_head_chars":4096},"cells_cut":0,"cells_raw":0,"read":"whole","date_system":"1900"}

{"sheet":"Teams","index":0,"n_rows":21,"n_cols":5,"rows_kept":21,"cut":false,"hidden":false,"merged":[]}
["Teams"]
["Arsenal",null,null,null,"How many times do each team play each other"]
["Aston Villa",null,null,null,2]
["Blackburn Rovers"]
["Bolton Wanderers",null,null,null,"Number of teams"]
["Chelsea",null,null,null,{"$f":"COUNTA(A2:A51)","v":20}]
{"$rows_left_out":16}
{"sheet":"Home","index":1,"n_rows":20,"n_cols":20,"rows_kept":20,"cut":false,"hidden":true,"merged":[]}
[null,"Bolton Wanderers","Swansea City","Manchester City","Queens Park Rangers","Tottenham Hotspur","Stoke City","West Bromwich Albion","Everton","Norwich","Blackburn Rovers","Manchester United","Sunderland","Aston Villa","Newcastle United","Wolves","Fulham","Liverpool","Chelsea","Arsenal"]
["Swansea City",1]
["Manchester City",2,3]
["Queens Park Rangers",3,4,5]
["Tottenham Hotspur",4,5,6,7]
["Stoke City",5,6,7,8,9]
{"$rows_left_out":15}
{"sheet":"Away","index":2,"n_rows":20,"n_cols":20,"rows_kept":20,"cut":false,"hidden":true,"merged":[]}
[null,"Bolton Wanderers","Swansea City","Manchester City","Queens Park Rangers","Tottenham Hotspur","Stoke City","West Bromwich Albion","Everton","Norwich","Blackburn Rovers","Manchester United","Sunderland","Aston Villa","Newcastle United","Wolves","Fulham","Liverpool","Chelsea","Arsenal"]
["Swansea City",1]
["Manchester City",2,3]
["Queens Park Rangers",3,4,5]
["Tottenham Hotspur",4,5,6,7]
["Stoke City",5,6,7,8,9]
{"$rows_left_out":15}
{"sheet":"Fixtures","index":3,"n_rows":455,"n_cols":7,"rows_kept":455,"cut":false,"hidden":false,"merged":[]}
["Week 1 Fixtures"]
["Swansea City",null,"v",null,"Bolton Wanderers",null,"Created by"]
["Arsenal",null,"v",null,"Manchester City",null,"www.computergaga.com"]
["Chelsea",null,"v",null,"Queens Park Rangers"]
["Liverpool",null,"v",null,"Tottenham Hotspur"]
["Fulham",null,"v",null,"Stoke City"]
{"$rows_left_out":450}
{"sheet":"Calculations","index":4,"n_rows":31,"n_cols":24,"rows_kept":31,"cut":false,"hidden":true,"merged":[[0,4,0,10],[0,11,0,17]]}
[null,null,null,null,"Home",null,null,null,null,null,null,"Away"]
["Rank Ties","Rank","Team","P","W","L","D","F","A","GD","Pts","W","L","D","F","A","GD","Pts","GD","Goals","Pts","Rank","GD Rank","Goals Rank"]
[{"$f":"IF(Teams!A2=\"\",\"\",RANK($B3,$B$3:$B$20,1)+COUNTIF($B$3:$B3,$B3)-1)","v":1},{"$f":"IF(Teams!A2=\"\",\"\",V3+W3+X3)","v":1},{"$f":"IF(Teams!A2=\"\",\"\",Teams!A2)","v":"Arsenal"},{"$f":"IF(Teams!A2=\"\",\"\",COUNTIFS(Fixtures!$A:$A,Calculations!$C3,Fixtures!$B:$B,\">=0\")+COUNTIFS(Fixtures!$E:$E,Calculations!$C3,Fixtures!$D:$D,\">=0\"))","v":0},{"$f":"IF(Teams!A2=\"\",\"\",SUMPRODUCT((Fixtures!$A:$A=Calculations!$C3)*(Fixtures!$B:$B>Fixtures!$D:$D)))","v":0},{"$f":"IF(Teams!A2=\"\",\"\",SUMPRODUCT((Fixtures!$A:$A=Calculations!$C3)*(Fixtures!$B:$B<Fixtures!$D:$D)))","v":0},{"$f":"IF(Teams!A2=\"\",\"\",SUMPRODUCT((Fixtures!$A:$A=Calculations!$C3)*(Fixtures!$B:$B=Fixtures!$D:$D)*(Fixtures!$B:$B<>\"\")))","v":0},{"$f":"IF(Teams!A2=\"\",\"\",SUMIFS(Fixtures!$B:$B,Fixtures!$A:$A,Calculations!$C3,Fixtures!$B:$B,\">=0\"))","v":0},{"$f":"IF(Teams!A2=\"\",\"\",SUMIFS(Fixtures!$D:$D,Fixtures!$A:$A,Calculations!$C3,Fixtures!$D:$D,\">=0\"))","v":0},{"$f":"IF(Teams!A2=\"\",\"\",H3-I3)","v":0},{"$f":"IF(Teams!A2=\"\",\"\",$E3*Data!$B$2+$G3*Data!$B$3)","v":0},{"$f":"IF(Teams!A2=\"\",\"\",SUMPRODUCT((Fixtures!$E:$E=Calculations!$C3)*(Fixtures!$D:$D>Fixtures!$B:$B)))","v":0},{"$f":"IF(Teams!A2=\"\",\"\",SUMPRODUCT((Fixtures!$E:$E=Calculations!$C3)*(Fixtures!$D:$D<Fixtures!$B:$B)))","v":0},{"$f":"IF(Teams!A2=\"\",\"\",SUMPRODUCT((Fixtures!$E:$E=Calculations!$C3)*(Fixtures!$D:$D=Fixtures!$B:$B)*(Fixtures!$D:$D<>\"\")))","v":0},{"$f":"IF(Teams!A2=\"\",\"\",SUMIFS(Fixtures!$D:$D,Fixtures!$E:$E,Calculations!$C3,Fixtures!$D:$D,\">=0\"))","v":0},{"$f":"IF(Teams!A2=\"\",\"\",SUMIFS(Fixtures!$B:$B,Fixtures!$E:$E,Calculations!$C3,Fixtures!$B:$B,\">=0\"))","v":0},{"$f":"IF(Teams!A2=\"\",\"\",O3-P3)","v":0},{"$f":"IF(Teams!A2=\"\",\"\",$L3*Data!$B$2+$N3*Data!$B$3)","v":0},{"$f":"IF(Teams!A2=\"\",\"\",J3+Q3)","v":0},{"$f":"IF(Teams!A2=\"\",\"\",H3+O3)","v":0},{"$f":"IF(Teams!A2=\"\",\"\",K3+R3)","v":0},{"$f":"IF(Teams!A2=\"\",\"\",RANK(U3,$U$3:$U$22))","v":1},{"$f":"IF(Teams!A2=\"\",\"\",SUMPRODUCT(($U$3:$U$22=U3)*($S$3:$S$22>S3)))","v":0},{"$f":"IF(Teams!A2=\"\",\"\",SUMPRODUCT(($U$3:$U$22=U3)*($S$3:$S$22=S3)*($T$3:$T$22>T3)))","v":0}]
[{"$f":"IF(Teams!A3=\"\",\"\",RANK($B4,$B$3:$B$20,1)+COUNTIF($B$3:$B4,$B4)-1)","v":2},{"$f":"IF(Teams!A3=\"\",\"\",V4+W4+X4)","v":1},{"$f":"IF(Teams!A3=\"\",\"\",Teams!A3)","v":"Aston Villa"},{"$f":"IF(Teams!A3=\"\",\"\",COUNTIFS(Fixtures!$A:$A,Calculations!$C4,Fixtures!$B:$B,\">=0\")+COUNTIFS(Fixtures!$E:$E,Calculations!$C4,Fixtures!$D:$D,\">=0\"))","v":0},{"$f":"IF(Teams!A3=\"\",\"\",SUMPRODUCT((Fixtures!$A:$A=Calculations!$C4)*(Fixtures!$B:$B>Fixtures!$D:$D)))","v":0},{"$f":"IF(Teams!A3=\"\",\"\",SUMPRODUCT((Fixtures!$A:$A=Calculations!$C4)*(Fixtures!$B:$B<Fixtures!$D:$D)))","v":0},{"$f":"IF(Teams!A3=\"\",\"\",SUMPRODUCT((Fixtures!$A:$A=Calculations!$C4)*(Fixtures!$B:$B=Fixtures!$D:$D)*(Fixtures!$B:$B<>\"\")))","v":0},{"$f":"IF(Teams!A3=\"\",\"\",SUMIFS(Fixtures!$B:$B,Fixtures!$A:$A,Calculations!$C4,Fixtures!$B:$B,\">=0\"))","v":0},{"$f":"IF(Teams!A3=\"\",\"\",SUMIFS(Fixtures!$D:$D,Fixtures!$A:$A,Calculations!$C4,Fixtures!$D:$D,\">=0\"))","v":0},{"$f":"IF(Teams!A3=\"\",\"\",H4-I4)","v":0},{"$f":"IF(Teams!A3=\"\",\"\",$E4*Data!$B$2+$G4*Data!$B$3)","v":0},{"$f":"IF(Teams!A3=\"\",\"\",SUMPRODUCT((Fixtures!$E:$E=Calculations!$C4)*(Fixtures!$D:$D>Fixtures!$B:$B)))","v":0},{"$f":"IF(Teams!A3=\"\",\"\",SUMPRODUCT((Fixtures!$E:$E=Calculations!$C4)*(Fixtures!$D:$D<Fixtures!$B:$B)))","v":0},{"$f":"IF(Teams!A3=\"\",\"\",SUMPRODUCT((Fixtures!$E:$E=Calculations!$C4)*(Fixtures!$D:$D=Fixtures!$B:$B)*(Fixtures!$D:$D<>\"\")))","v":0},{"$f":"IF(Teams!A3=\"\",\"\",SUMIFS(Fixtures!$D:$D,Fixtures!$E:$E,Calculations!$C4,Fixtures!$D:$D,\">=0\"))","v":0},{"$f":"IF(Teams!A3=\"\",\"\",SUMIFS(Fixtures!$B:$B,Fixtures!$E:$E,Calculations!$C4,Fixtures!$B:$B,\">=0\"))","v":0},{"$f":"IF(Teams!A3=\"\",\"\",O4-P4)","v":0},{"$f":"IF(Teams!A3=\"\",\"\",$L4*Data!$B$2+$N4*Data!$B$3)","v":0},{"$f":"IF(Teams!A3=\"\",\"\",J4+Q4)","v":0},{"$f":"IF(Teams!A3=\"\",\"\",H4+O4)","v":0},{"$f":"IF(Teams!A3=\"\",\"\",K4+R4)","v":0},{"$f":"IF(Teams!A3=\"\",\"\",RANK(U4,$U$3:$U$22))","v":1},{"$f":"IF(Teams!A3=\"\",\"\",SUMPRODUCT(($U$3:$U$22=U4)*($S$3:$S$22>S4)))","v":0},{"$f":"IF(Teams!A3=\"\",\"\",SUMPRODUCT(($U$3:$U$22=U4)*($S$3:$S$22=S4)*($T$3:$T$22>T4)))","v":0}]
[{"$f":"IF(Teams!A4=\"\",\"\",RANK($B5,$B$3:$B$20,1)+COUNTIF($B$3:$B5,$B5)-1)","v":3},{"$f":"IF(Teams!A4=\"\",\"\",V5+W5+X5)","v":1},{"$f":"IF(Teams!A4=\"\",\"\",Teams!A4)","v":"Blackburn Rovers"},{"$f":"IF(Teams!A4=\"\",\"\",COUNTIFS(Fixtures!$A:$A,Calculations!$C5,Fixtures!$B:$B,\">=0\")+COUNTIFS(Fixtures!$E:$E,Calculations!$C5,Fixtures!$D:$D,\">=0\"))","v":0},{"$f":"IF(Teams!A4=\"\",\"\",SUMPRODUCT((Fixtures!$A:$A=Calculations!$C5)*(Fixtures!$B:$B>Fixtures!$D:$D)))","v":0},{"$f":"IF(Teams!A4=\"\",\"\",SUMPRODUCT((Fixtures!$A:$A=Calculations!$C5)*(Fixtures!$B:$B<Fixtures!$D:$D)))","v":0},{"$f":"IF(Teams!A4=\"\",\"\",SUMPRODUCT((Fixtures!$A:$A=Calculations!$C5)*(Fixtures!$B:$B=Fixtures!$D:$D)*(Fixtures!$B:$B<>\"\")))","v":0},{"$f":"IF(Teams!A4=\"\",\"\",SUMIFS(Fixtures!$B:$B,Fixtures!$A:$A,Calculations!$C5,Fixtures!$B:$B,\">=0\"))","v":0},{"$f":"IF(Teams!A4=\"\",\"\",SUMIFS(Fixtures!$D:$D,Fixtures!$A:$A,Calculations!$C5,Fixtures!$D:$D,\">=0\"))","v":0},{"$f":"IF(Teams!A4=\"\",\"\",H5-I5)","v":0},{"$f":"IF(Teams!A4=\"\",\"\",$E5*Data!$B$2+$G5*Data!$B$3)","v":0},{"$f":"IF(Teams!A4=\"\",\"\",SUMPRODUCT((Fixtures!$E:$E=Calculations!$C5)*(Fixtures!$D:$D>Fixtures!$B:$B)))","v":0},{"$f":"IF(Teams!A4=\"\",\"\",SUMPRODUCT((Fixtures!$E:$E=Calculations!$C5)*(Fixtures!$D:$D<Fixtures!$B:$B)))","v":0},{"$f":"IF(Teams!A4=\"\",\"\",SUMPRODUCT((Fixtures!$E:$E=Calculations!$C5)*(Fixtures!$D:$D=Fixtures!$B:$B)*(Fixtures!$D:$D<>\"\")))","v":0},{"$f":"IF(Teams!A4=\"\",\"\",SUMIFS(Fixtures!$D:$D,Fixtures!$E:$E,Calculations!$C5,Fixtures!$D:$D,\">=0\"))","v":0},{"$f":"IF(Teams!A4=\"\",\"\",SUMIFS(Fixtures!$B:$B,Fixtures!$E:$E,Calculations!$C5,Fixtures!$B:$B,\">=0\"))","v":0},{"$f":"IF(Teams!A4=\"\",\"\",O5-P5)","v":0},{"$f":"IF(Teams!A4=\"\",\"\",$L5*Data!$B$2+$N5*Data!$B$3)","v":0},{"$f":"IF(Teams!A4=\"\",\"\",J5+Q5)","v":0},{"$f":"IF(Teams!A4=\"\",\"\",H5+O5)","v":0},{"$f":"IF(Teams!A4=\"\",\"\",K5+R5)","v":0},{"$f":"IF(Teams!A4=\"\",\"\",RANK(U5,$U$3:$U$22))","v":1},{"$f":"IF(Teams!A4=\"\",\"\",SUMPRODUCT(($U$3:$U$22=U5)*($S$3:$S$22>S5)))","v":0},{"$f":"IF(Teams!A4=\"\",\"\",SUMPRODUCT(($U$3:$U$22=U5)*($S$3:$S$22=S5)*($T$3:$T$22>T5)))","v":0}]
[{"$f":"IF(Teams!A5=\"\",\"\",RANK($B6,$B$3:$B$20,1)+COUNTIF($B$3:$B6,$B6)-1)","v":4},{"$f":"IF(Teams!A5=\"\",\"\",V6+W6+X6)","v":1},{"$f":"IF(Teams!A5=\"\",\"\",Teams!A5)","v":"Bolton Wanderers"},{"$f":"IF(Teams!A5=\"\",\"\",COUNTIFS(Fixtures!$A:$A,Calculations!$C6,Fixtures!$B:$B,\">=0\")+COUNTIFS(Fixtures!$E:$E,Calculations!$C6,Fixtures!$D:$D,\">=0\"))","v":0},{"$f":"IF(Teams!A5=\"\",\"\",SUMPRODUCT((Fixtures!$A:$A=Calculations!$C6)*(Fixtures!$B:$B>Fixtures!$D:$D)))","v":0},{"$f":"IF(Teams!A5=\"\",\"\",SUMPRODUCT((Fixtures!$A:$A=Calculations!$C6)*(Fixtures!$B:$B<Fixtures!$D:$D)))","v":0},{"$f":"IF(Teams!A5=\"\",\"\",SUMPRODUCT((Fixtures!$A:$A=Calculations!$C6)*(Fixtures!$B:$B=Fixtures!$D:$D)*(Fixtures!$B:$B<>\"\")))","v":0},{"$f":"IF(Teams!A5=\"\",\"\",SUMIFS(Fixtures!$B:$B,Fixtures!$A:$A,Calculations!$C6,Fixtures!$B:$B,\">=0\"))","v":0},{"$f":"IF(Teams!A5=\"\",\"\",SUMIFS(Fixtures!$D:$D,Fixtures!$A:$A,Calculations!$C6,Fixtures!$D:$D,\">=0\"))","v":0},{"$f":"IF(Teams!A5=\"\",\"\",H6-I6)","v":0},{"$f":"IF(Teams!A5=\"\",\"\",$E6*Data!$B$2+$G6*Data!$B$3)","v":0},{"$f":"IF(Teams!A5=\"\",\"\",SUMPRODUCT((Fixtures!$E:$E=Calculations!$C6)*(Fixtures!$D:$D>Fixtures!$B:$B)))","v":0},{"$f":"IF(Teams!A5=\"\",\"\",SUMPRODUCT((Fixtures!$E:$E=Calculations!$C6)*(Fixtures!$D:$D<Fixtures!$B:$B)))","v":0},{"$f":"IF(Teams!A5=\"\",\"\",SUMPRODUCT((Fixtures!$E:$E=Calculations!$C6)*(Fixtures!$D:$D=Fixtures!$B:$B)*(Fixtures!$D:$D<>\"\")))","v":0},{"$f":"IF(Teams!A5=\"\",\"\",SUMIFS(Fixtures!$D:$D,Fixtures!$E:$E,Calculations!$C6,Fixtures!$D:$D,\">=0\"))","v":0},{"$f":"IF(Teams!A5=\"\",\"\",SUMIFS(Fixtures!$B:$B,Fixtures!$E:$E,Calculations!$C6,Fixtures!$B:$B,\">=0\"))","v":0},{"$f":"IF(Teams!A5=\"\",\"\",O6-P6)","v":0},{"$f":"IF(Teams!A5=\"\",\"\",$L6*Data!$B$2+$N6*Data!$B$3)","v":0},{"$f":"IF(Teams!A5=\"\",\"\",J6+Q6)","v":0},{"$f":"IF(Teams!A5=\"\",\"\",H6+O6)","v":0},{"$f":"IF(Teams!A5=\"\",\"\",K6+R6)","v":0},{"$f":"IF(Teams!A5=\"\",\"\",RANK(U6,$U$3:$U$22))","v":1},{"$f":"IF(Teams!A5=\"\",\"\",SUMPRODUCT(($U$3:$U$22=U6)*($S$3:$S$22>S6)))","v":0},{"$f":"IF(Teams!A5=\"\",\"\",SUMPRODUCT(($U$3:$U$22=U6)*($S$3:$S$22=S6)*($T$3:$T$22>T6)))","v":0}]
{"$rows_left_out":26}
{"sheet":"League Table","index":5,"n_rows":31,"n_cols":17,"rows_kept":31,"cut":false,"hidden":false,"merged":[[0,3,0,7],[0,8,0,12]]}
[null,null,null,"Home",null,null,null,null,"Away"]
["Position","Team","P","W","L","D","F","A","W","L","D","F","A","GD","Pts"]
[{"$f":"IF(Calculations!$C3=\"\",\"\",ROW($B3)-2)","v":1},{"$f":"IF(Calculations!$C3=\"\",\"\",VLOOKUP(MIN(Calculations!$A$3:$A$31),Calculations!$A$3:$C$31,3,FALSE))","v":"Arsenal"},{"$f":"IF(Calculations!$C3=\"\",\"\",VLOOKUP($B3,Calculations!$C$3:$T$31,2,FALSE))","v":0},{"$f":"IF(Calculations!$C3=\"\",\"\",VLOOKUP($B3,Calculations!$C$3:$T$31,3,FALSE))","v":0},{"$f":"IF(Calculations!$C3=\"\",\"\",VLOOKUP($B3,Calculations!$C$3:$T$31,4,FALSE))","v":0},{"$f":"IF(Calculations!$C3=\"\",\"\",VLOOKUP($B3,Calculations!$C$3:$T$31,5,FALSE))","v":0},{"$f":"IF(Calculations!$C3=\"\",\"\",VLOOKUP($B3,Calculations!$C$3:$T$31,6,FALSE))","v":0},{"$f":"IF(Calculations!$C3=\"\",\"\",VLOOKUP($B3,Calculations!$C$3:$T$31,7,FALSE))","v":0},{"$f":"IF(Calculations!$C3=\"\",\"\",VLOOKUP($B3,Calculations!$C$3:$T$31,10,FALSE))","v":0},{"$f":"IF(Calculations!$C3=\"\",\"\",VLOOKUP($B3,Calculations!$C$3:$T$31,11,FALSE))","v":0},{"$f":"IF(Calculations!$C3=\"\",\"\",VLOOKUP($B3,Calculations!$C$3:$T$31,12,FALSE))","v":0},{"$f":"IF(Calculations!$C3=\"\",\"\",VLOOKUP($B3,Calculations!$C$3:$T$31,13,FALSE))","v":0},{"$f":"IF(Calculations!$C3=\"\",\"\",VLOOKUP($B3,Calculations!$C$3:$T$31,14,FALSE))","v":0},{"$f":"IF(Calculations!$C3=\"\",\"\",VLOOKUP($B3,Calculations!$C$3:$T$31,17,FALSE))","v":0},{"$f":"IF(Calculations!$C3=\"\",\"\",VLOOKUP($B3,Calculations!$C$3:$U$31,19,FALSE))","v":0},null,"Created by"]
[{"$f":"IF(Calculations!$C4=\"\",\"\",ROW($B4)-2)","v":2},{"$f":"IF(Calculations!$C4=\"\",\"\",VLOOKUP(SMALL(Calculations!$A$3:$A$31,A4),Calculations!$A$3:$C$31,3,FALSE))","v":"Aston Villa"},{"$f":"IF(Calculations!$C4=\"\",\"\",VLOOKUP($B4,Calculations!$C$3:$T$31,2,FALSE))","v":0},{"$f":"IF(Calculations!$C4=\"\",\"\",VLOOKUP($B4,Calculations!$C$3:$T$31,3,FALSE))","v":0},{"$f":"IF(Calculations!$C4=\"\",\"\",VLOOKUP($B4,Calculations!$C$3:$T$31,4,FALSE))","v":0},{"$f":"IF(Calculations!$C4=\"\",\"\",VLOOKUP($B4,Calculations!$C$3:$T$31,5,FALSE))","v":0},{"$f":"IF(Calculations!$C4=\"\",\"\",VLOOKUP($B4,Calculations!$C$3:$T$31,6,FALSE))","v":0},{"$f":"IF(Calculations!$C4=\"\",\"\",VLOOKUP($B4,Calculations!$C$3:$T$31,7,FALSE))","v":0},{"$f":"IF(Calculations!$C4=\"\",\"\",VLOOKUP($B4,Calculations!$C$3:$T$31,10,FALSE))","v":0},{"$f":"IF(Calculations!$C4=\"\",\"\",VLOOKUP($B4,Calculations!$C$3:$T$31,11,FALSE))","v":0},{"$f":"IF(Calculations!$C4=\"\",\"\",VLOOKUP($B4,Calculations!$C$3:$T$31,12,FALSE))","v":0},{"$f":"IF(Calculations!$C4=\"\",\"\",VLOOKUP($B4,Calculations!$C$3:$T$31,13,FALSE))","v":0},{"$f":"IF(Calculations!$C4=\"\",\"\",VLOOKUP($B4,Calculations!$C$3:$T$31,14,FALSE))","v":0},{"$f":"IF(Calculations!$C4=\"\",\"\",VLOOKUP($B4,Calculations!$C$3:$T$31,17,FALSE))","v":0},{"$f":"IF(Calculations!$C4=\"\",\"\",VLOOKUP($B4,Calculations!$C$3:$U$31,19,FALSE))","v":0},null,"www.computergaga.com"]
[{"$f":"IF(Calculations!$C5=\"\",\"\",ROW($B5)-2)","v":3},{"$f":"IF(Calculations!$C5=\"\",\"\",VLOOKUP(SMALL(Calculations!$A$3:$A$31,A5),Calculations!$A$3:$C$31,3,FALSE))","v":"Blackburn Rovers"},{"$f":"IF(Calculations!$C5=\"\",\"\",VLOOKUP($B5,Calculations!$C$3:$T$31,2,FALSE))","v":0},{"$f":"IF(Calculations!$C5=\"\",\"\",VLOOKUP($B5,Calculations!$C$3:$T$31,3,FALSE))","v":0},{"$f":"IF(Calculations!$C5=\"\",\"\",VLOOKUP($B5,Calculations!$C$3:$T$31,4,FALSE))","v":0},{"$f":"IF(Calculations!$C5=\"\",\"\",VLOOKUP($B5,Calculations!$C$3:$T$31,5,FALSE))","v":0},{"$f":"IF(Calculations!$C5=\"\",\"\",VLOOKUP($B5,Calculations!$C$3:$T$31,6,FALSE))","v":0},{"$f":"IF(Calculations!$C5=\"\",\"\",VLOOKUP($B5,Calculations!$C$3:$T$31,7,FALSE))","v":0},{"$f":"IF(Calculations!$C5=\"\",\"\",VLOOKUP($B5,Calculations!$C$3:$T$31,10,FALSE))","v":0},{"$f":"IF(Calculations!$C5=\"\",\"\",VLOOKUP($B5,Calculations!$C$3:$T$31,11,FALSE))","v":0},{"$f":"IF(Calculations!$C5=\"\",\"\",VLOOKUP($B5,Calculations!$C$3:$T$31,12,FALSE))","v":0},{"$f":"IF(Calculations!$C5=\"\",\"\",VLOOKUP($B5,Calculations!$C$3:$T$31,13,FALSE))","v":0},{"$f":"IF(Calculations!$C5=\"\",\"\",VLOOKUP($B5,Calculations!$C$3:$T$31,14,FALSE))","v":0},{"$f":"IF(Calculations!$C5=\"\",\"\",VLOOKUP($B5,Calculations!$C$3:$T$31,17,FALSE))","v":0},{"$f":"IF(Calculations!$C5=\"\",\"\",VLOOKUP($B5,Calculations!$C$3:$U$31,19,FALSE))","v":0}]
[{"$f":"IF(Calculations!$C6=\"\",\"\",ROW($B6)-2)","v":4},{"$f":"IF(Calculations!$C6=\"\",\"\",VLOOKUP(SMALL(Calculations!$A$3:$A$31,A6),Calculations!$A$3:$C$31,3,FALSE))","v":"Bolton Wanderers"},{"$f":"IF(Calculations!$C6=\"\",\"\",VLOOKUP($B6,Calculations!$C$3:$T$31,2,FALSE))","v":0},{"$f":"IF(Calculations!$C6=\"\",\"\",VLOOKUP($B6,Calculations!$C$3:$T$31,3,FALSE))","v":0},{"$f":"IF(Calculations!$C6=\"\",\"\",VLOOKUP($B6,Calculations!$C$3:$T$31,4,FALSE))","v":0},{"$f":"IF(Calculations!$C6=\"\",\"\",VLOOKUP($B6,Calculations!$C$3:$T$31,5,FALSE))","v":0},{"$f":"IF(Calculations!$C6=\"\",\"\",VLOOKUP($B6,Calculations!$C$3:$T$31,6,FALSE))","v":0},{"$f":"IF(Calculations!$C6=\"\",\"\",VLOOKUP($B6,Calculations!$C$3:$T$31,7,FALSE))","v":0},{"$f":"IF(Calculations!$C6=\"\",\"\",VLOOKUP($B6,Calculations!$C$3:$T$31,10,FALSE))","v":0},{"$f":"IF(Calculations!$C6=\"\",\"\",VLOOKUP($B6,Calculations!$C$3:$T$31,11,FALSE))","v":0},{"$f":"IF(Calculations!$C6=\"\",\"\",VLOOKUP($B6,Calculations!$C$3:$T$31,12,FALSE))","v":0},{"$f":"IF(Calculations!$C6=\"\",\"\",VLOOKUP($B6,Calculations!$C$3:$T$31,13,FALSE))","v":0},{"$f":"IF(Calculations!$C6=\"\",\"\",VLOOKUP($B6,Calculations!$C$3:$T$31,14,FALSE))","v":0},{"$f":"IF(Calculations!$C6=\"\",\"\",VLOOKUP($B6,Calculations!$C$3:$T$31,17,FALSE))","v":0},{"$f":"IF(Calculations!$C6=\"\",\"\",VLOOKUP($B6,Calculations!$C$3:$U$31,19,FALSE))","v":0}]
{"$rows_left_out":26}
{"sheet":"Random","index":6,"n_rows":51,"n_cols":4,"rows_kept":51,"cut":false,"hidden":true,"merged":[]}
["Teams","Random Number","ID"]
[{"$f":"IF(Teams!A2=\"\",\"\",Teams!A2)","v":"Arsenal"},{"$f":"IF(A2=\"\",\"\",RAND())","v":0.93614486534998631},{"$f":"IF(B2=\"\",\"\",RANK(B2,INDIRECT(\"$B$2:$B$\"&Teams!$E$6+1))+COUNTIF(C$1:C1,C1)-1)","v":4},"Bolton Wanderers"]
[{"$f":"IF(Teams!A3=\"\",\"\",Teams!A3)","v":"Aston Villa"},0.37568086516485488,{"$f":"IF(B3=\"\",\"\",RANK(B3,INDIRECT(\"$B$2:$B$\"&Teams!$E$6+1))+COUNTIF(C$1:C2,C2)-1)","v":14},"Swansea City"]
[{"$f":"IF(Teams!A4=\"\",\"\",Teams!A4)","v":"Blackburn Rovers"},0.30034257412095788,{"$f":"IF(B4=\"\",\"\",RANK(B4,INDIRECT(\"$B$2:$B$\"&Teams!$E$6+1))+COUNTIF(C$1:C3,C3)-1)","v":18},"Manchester City"]
[{"$f":"IF(Teams!A5=\"\",\"\",Teams!A5)","v":"Bolton Wanderers"},0.81736170428687893,{"$f":"IF(B5=\"\",\"\",RANK(B5,INDIRECT(\"$B$2:$B$\"&Teams!$E$6+1))+COUNTIF(C$1:C4,C4)-1)","v":6},"Queens Park Rangers"]
[{"$f":"IF(Teams!A6=\"\",\"\",Teams!A6)","v":"Chelsea"},0.48757440134105934,{"$f":"IF(B6=\"\",\"\",RANK(B6,INDIRECT(\"$B$2:$B$\"&Teams!$E$6+1))+COUNTIF(C$1:C5,C5)-1)","v":10},"Tottenham Hotspur"]
{"$rows_left_out":46}
{"sheet":"Data","index":7,"n_rows":3,"n_cols":2,"rows_kept":3,"cut":false,"hidden":true,"merged":[]}
["Pts earned"]
["Win",3]
["Draw",1]